{"text_format":"1","workbook":"xlsx","n_sheets":12,"sheets":["Site","D.A. A","D.A. B","D.A. C","D.A. D","D.A. E","Water Quality Compliance","Runoff Volume and CN","Summary","Notes","Summary_BU","VHid"],"not_rendered":{"charts":0,"images":2,"macros":1,"external_links":0,"defined_names":31,"comments":5,"pivot_tables":0},"unopened":[],"bounds":{"document_bytes":16777216,"sheet_cells":100000,"rows_first":2000,"rows_last":500,"rows_between":2000,"halvings":0,"cell_chars":16384,"cell_head_chars":4096},"cells_cut":0,"cells_raw":0,"read":"whole","date_system":"1900"}

{"sheet":"Site","index":0,"n_rows":67,"n_cols":19,"rows_kept":67,"cut":false,"hidden":false,"merged":[[3,1,3,4],[4,1,4,4],[37,4,37,11],[37,0,37,2],[11,3,11,4],[9,2,9,4],[9,7,9,8],[12,6,12,8],[13,6,13,8],[10,6,10,8],[12,10,12,12],[13,10,13,12],[63,3,63,5],[7,1,7,5],[52,0,52,2],[39,4,39,5],[10,9,10,12],[39,0,39,2],[14,7,14,9],[66,1,66,2],[66,6,66,7],[66,8,66,9],[39,7,39,8],[40,7,40,8],[62,3,62,5],[61,2,61,7],[65,1,65,9],[57,0,57,1],[60,7,60,8],[59,0,60,2],[59,4,59,5],[40,4,40,5],[52,4,52,11],[39,10,39,11],[40,10,40,11]]}
[null,null,null,null,"DEQ Virginia Runoff Reduction Method Re-Development Compliance Spreadsheet  - Version 3.0 ",null,null,null,null,null,null,null,null,null,null,"#errors"]
[null,null,null,null,null,null,null,null,null,null,null,null,null,null,"Check Areas!",{"$f":"IF(OR(F20=0,F27=0),\"\",COUNTIF(B27:E27,\"Check Areas!\"))","v":""},null,null,"Yes"]
[null,null,null,null,null,null,null,null,null,null,null,null,null,null,"ENTER TOTAL DISTURBED AREA ABOVE!",{"$f":"IF(F10>0,0,IF(OR(F20=0,F27=0),\"\",1))","v":""},null,null,"No"]
["Project Name: ",null,null,null,null,null,null,null,null,null,null,null,null,null,"ENTER LAND COVER AREAS!"]
["Date: ",null,null,null,null,null,null,null,null,null,null,null,null,null,"Total errors",{"$f":"IF(AND(P2=\"\",P3=\"\"),0,IF(OR(P2=\"\",P3=\"\"),\"incomplete\",IF(P2+P3=0,0,P2+P3)))","v":0}]
[null,null,null,"Linear Development Project?","No"]
["Site Information"]
[null,{"$f":"IF(AND($F$10=0,$F$20=0,$F$27=0),\"ENTER AREAS IN DATA INPUT CELLS FOR RESULTS\",\"\")","v":"ENTER AREAS IN DATA INPUT CELLS FOR RESULTS"}]
["Post-Development Project (Treatment Volume and Loads)",null,null,null,null,null,null,null,null,null,null,null,null,null,"Total Site Area =",{"$f":"S13+S20","v":0}]
[null,null,"Enter Total Disturbed Area (acres)  →",null,null,null,{"$f":"IF(P3=1,\"←\",\"\")","v":""},"Check:",null,true]
[null,null,null,null,null,null,"BMP Design Specifications List:",null,null,"2013 Draft Stds & Specs"]
[null,null,null," Maximum reduction required:",null,{"$f":"IF(F10=0,\"--\",$I$58)","v":"--"},null,null,"Linear project?",{"$f":"IF(E6=\"yes\",\"Yes\",\"No\")","v":"No"},null,null,null,null,"A soils","B Soils","C Soils","D Soils","Total"]
[null,null,null,null,"The site's net increase in impervious cover (acres) is:",{"$f":"IF(OR(F12=\"--\",P5=\"incomplete\"),\"--\",IF(P2>0,\"x\",$L$48))","v":"--"},"Land cover areas entered correctly?",null,null,{"$f":"IF(P2=\"\",\"___\",IF(P2=0,\"✔\",IF(P2>0,\"x\",\"___\")))","v":"___"},{"$f":"IF(AND(P2>0,F20>0,F27>0),\"Pre- & Post Area Inputs must be equal!\",\"\")","v":""},null,null,"Increase in Imperv.:",{"$f":"B26-B19","v":0},{"$f":"C26-C19","v":0},{"$f":"D26-D19","v":0},{"$f":"E26-E19","v":0},{"$f":"SUM(O13:R13)","v":0}]
[null,null,null,null,"Post-Development TP Load Reduction for Site (lb/yr):",{"$f":"+IF(OR($F$12=\"--\",$P$5=\"incomplete\"),\"--\",IF($E$60=$O$3,\"x\",(IF($P$2>0,\"x\",IF($E$6=\"yes\",$G$64,$G$63)))))","v":"--"},"Total disturbed area entered?",null,null,{"$f":"IF(P3=1,\"x\",IF(P3=0,\"✔\",IF(P3=\"\",\"___\",\"\")))","v":"___"},{"$f":"IF(P3=1,\"Total disturbed area missing!\",IF(AND(F10>F27,P3=0),\"Total disturbed area > Post-Development area!\",\"\"))","v":""}]
["Pre-ReDevelopment Land Cover  (acres)",null,null,null,null,null,null,{"$f":"IF($G$63<=0,\"TP LOAD REDUCTION NOT REQUIRED\",\"\")","v":""},null,null,null,null,null,null,"Pre-ReDevelopment-ADJUSTED"]
[null,"A Soils","B Soils","C Soils","D Soils","Totals",null,null,null,null,null,null,null,null,"A soils","B Soils","C Soils","D Soils","Total"]
["Forest/Open Space (acres) -- undisturbed forest/open space",null,null,null,null,{"$f":"SUM(B17:E17)","v":0},null,null,null,null,null,null,null,"F/O",{"$f":"IF(B$24>=B$17,B17,IF(B$25>=B$18,B17-(B$26-B$19),B$24))","v":0},{"$f":"IF(C$24>=C$17,C17,IF(C$25>=C$18,C17-(C$26-C$19),C$24))","v":0},{"$f":"IF(D$24>=D$17,D17,IF(D$25>=D$18,D17-(D$26-D$19),D$24))","v":0},{"$f":"IF(E$24>=E$17,E17,IF(E$25>=E$18,E17-(E$26-E$19),E$24))","v":0},{"$f":"SUM(O17:R17)","v":0}]
["Managed Turf (acres) -- disturbed, graded for yards or other turf to be mowed/managed",null,null,null,null,{"$f":"SUM(B18:E18)","v":0},null,null,null,null,null,null,null,"MT",{"$f":"IF(B$24>=B$17,B$18-(B$26-B$19),IF(B$25>=B$18,B$18,B$25))","v":0},{"$f":"IF(C$24>=C$17,C$18-(C$26-C$19),IF(C$25>=C$18,C$18,C$25))","v":0},{"$f":"IF(D$24>=D$17,D$18-(D$26-D$19),IF(D$25>=D$18,D$18,D$25))","v":0},{"$f":"IF(E$24>=E$17,E$18-(E$26-E$19),IF(E$25>=E$18,E$18,E$25))","v":0},{"$f":"SUM(O18:R18)","v":0}]
["Impervious Cover (acres)",null,null,null,null,{"$f":"SUM(B19:E19)","v":0},null,null,null,null,null,null,null,"IC",{"$f":"B$19","v":0},{"$f":"C$19","v":0},{"$f":"D$19","v":0},{"$f":"E$19","v":0},{"$f":"SUM(O19:R19)","v":0}]
[null,null,null,null,null,{"$f":"SUM(F17:F19)","v":0},null,null,null,null,null,null,null,null,null,null,null,"Total",{"$f":"SUM(S17:S19)","v":0}]
[]
["Post-Development Land Cover  (acres)"]
[null,"A Soils","B Soils","C Soils","D Soils","Totals"]
["Forest/Open Space (acres) -- undisturbed, protected forest/open space or reforested land",null,null,null,null,{"$f":"SUM(B24:E24)","v":0},{"$f":"IF(F24>0,\"*\",\"\")","v":""}]
["Managed Turf (acres) -- disturbed, graded for yards or other turf to be mowed/managed",null,null,null,null,{"$f":"SUM(B25:E25)","v":0}]
["Impervious Cover (acres)",null,null,null,null,{"$f":"SUM(B26:E26)","v":0}]
["Area Check",{"$f":"IF((ABS(ROUND(SUM(B17:B19),4)-ROUND(SUM(B24:B26),4))>0),$O$2,\"OK.\")","v":"OK."},{"$f":"IF((ABS(ROUND(SUM(C17:C19),4)-ROUND(SUM(C24:C26),4))>0),$O$2,\"OK.\")","v":"OK."},{"$f":"IF((ABS(ROUND(SUM(D17:D19),4)-ROUND(SUM(D24:D26),4))>0),$O$2,\"OK.\")","v":"OK."},{"$f":"IF((ABS(ROUND(SUM(E17:E19),4)-ROUND(SUM(E24:E26),4))>0),$O$2,\"OK.\")","v":"OK."},{"$f":"SUM(F24:F26)","v":0}]
[{"$f":"IF(F24>0,\"* Forest/Open Space areas must be protected in accordance with the Virginia Runoff Reduction Method\",\"\")","v":""}]
[]
["Constants",null,null,"Runoff Coefficients (Rv)"]
["Annual Rainfall (inches)",43,null,null,"A Soils","B Soils","C Soils","D Soils"]
["Target Rainfall Event (inches)",1,null,"Forest/Open Space",0.02,0.03,0.04,0.05]
["Total Phosphorus (TP) EMC (mg/L)",0.26,null,"Managed Turf",0.15,0.2,0.22,0.25]
["Total Nitrogen (TN) EMC (mg/L)",1.86,null,"Impervious Cover",0.95,0.95,0.95,0.95]
["Target TP Load (lb/acre/yr)",0.41]
["Pj (unitless correction factor)",0.9]
[]
["LAND COVER SUMMARY --  PRE-REDEVELOPMENT",null,null,null,"LAND COVER SUMMARY -- POST DEVELOPMENT"]
[]
["Land Cover Summary-Pre",null,null,null,"Land Cover Summary-Post (Final)",null,null,"Land Cover Summary-Post",null,null,"Land Cover Summary-Post"]
["Pre-ReDevelopment","Listed","Adjusted1",null,"Post ReDev. & New Impervious",null,null,"Post-ReDevelopment",null,null,"Post-Development New Impervious"]
["Forest/Open Space Cover (acres)",{"$f":"IF(F13=\"--\",\"--\",IF(P2>0,\"x\",F17))","v":"--"},{"$f":"IF(F13=\"--\",\"--\",IF(P2>0,\"x\",IF(F19>=F26,B42,IFERROR($S$17,0))))","v":"--"},null,"Forest/Open Space Cover (acres)",{"$f":"IF(F13=\"--\",\"--\",IF(P2>0,\"x\",$I$42))","v":"--"},null,"Forest/Open Space Cover (acres)",{"$f":"IF(F13=\"--\",\"--\",IF(P2>0,\"x\",$F$24))","v":"--"}]
["Weighted Rv(forest)",{"$f":"IF(OR(B42=\"--\",B42=\"x\"),B42,IFERROR(SUMPRODUCT(B17:E17,E32:H32)/B42,0))","v":"--"},{"$f":"IF(OR(C42=\"--\",C42=\"x\"),C42,IF(F26-F19<=0,B43,IFERROR(SUMPRODUCT(O17:R17,E32:H32)/C42,0)))","v":"--"},null,"Weighted Rv(forest)",{"$f":"IF(OR(F42=\"--\",F42=\"x\"),F42,$I$43)","v":"--"},null,"Weighted Rv(forest)",{"$f":"IF(OR(I42=\"--\",I42=\"x\"),I42,IFERROR(SUMPRODUCT($B$24:$E$24,$E$32:$H$32)/$I$42,0))","v":"--"}]
["% Forest",{"$f":"IF(OR(B42=\"--\",B42=\"x\"),B42,IFERROR(SUM(B42)/B$51,0))","v":"--"},{"$f":"IF(OR(C42=\"--\",C42=\"x\"),C42,IFERROR(C42/C$51,0))","v":"--"},null,"% Forest",{"$f":"IF(OR(F42=\"--\",F42=\"x\"),F42,IFERROR($F$42/$F$51,\"--\"))","v":"--"},null,"% Forest",{"$f":"IF(OR(I42=\"--\",I42=\"x\"),I42,IFERROR($I$42/$I$51,0))","v":"--"}]
["Managed Turf Cover (acres)",{"$f":"IF(OR(B42=\"--\",B42=\"x\"),B42,F18)","v":"--"},{"$f":"IF(OR(C42=\"--\",C42=\"x\"),C42,IF(F19>=F26,B45,IFERROR(S18,0)))","v":"--"},null,"Managed Turf Cover (acres)",{"$f":"IF(OR(F42=\"--\",F42=\"x\"),F42,$I$45)","v":"--"},null,"Managed Turf Cover (acres)",{"$f":"IF(OR(I42=\"--\",I42=\"x\"),I42,$F$25)","v":"--"}]
["Weighted Rv(turf)",{"$f":"IF(OR(B42=\"--\",B42=\"x\"),B42,IFERROR(SUMPRODUCT(B18:E18,E33:H33)/B45,0))","v":"--"},{"$f":"IF(OR(C42=\"--\",C42=\"x\"),C42,IFERROR(IF(F26-F19<=0,B46,IFERROR(SUMPRODUCT(O18:R18,E33:H33)/C45,0)),0))","v":"--"},null,"Weighted Rv (turf)",{"$f":"IF(OR(F42=\"--\",F42=\"x\"),F42,$I$46)","v":"--"},null,"Weighted Rv (turf)",{"$f":"IF(OR(I42=\"--\",I42=\"x\"),I42,IFERROR(SUMPRODUCT($B$25:$E$25,$E$33:$H$33)/$I$45,0))","v":"--"}]
["% Managed Turf",{"$f":"IF(OR(B42=\"--\",B42=\"x\"),B42,IFERROR(B45/B$51,0))","v":"--"},{"$f":"IF(OR(C42=\"--\",C42=\"x\"),C42,IFERROR(C45/C$51,0))","v":"--"},null,"% Managed Turf",{"$f":"IF(OR(F42=\"--\",F42=\"x\"),F42,IFERROR($F$45/$F$51,\"--\"))","v":"--"},null,"% Managed Turf",{"$f":"IF(OR(I42=\"--\",I42=\"x\"),I42,IFERROR($I$45/$I$51,0))","v":"--"}]
["Impervious Cover (acres)",{"$f":"IF(OR(B42=\"--\",B42=\"x\"),B42,F19)","v":"--"},{"$f":"B48","v":"--"},null,"Impervious Cover (acres)",{"$f":"IF(OR(F42=\"--\",F42=\"x\"),F42,$I$48+$L$48)","v":"--"},null,"ReDev. Impervious Cover (acres)",{"$f":"IF(OR(I42=\"--\",I42=\"x\"),I42,$F$26-$L$48)","v":"--"},null,"New Impervious Cover (acres)",{"$f":"IF(P2=1,\"--\",IF(P5>0,\"x\",IF($F$26-$F$19<0,0,$F$26-$F$19)))","v":0}]
["Rv(impervious)",{"$f":"IF(OR(F13=\"--\",P2>0),\"--\",E34)","v":"--"},{"$f":"B49","v":"--"},null,"Rv(impervious)",{"$f":"IF(OR(F13=\"--\",P2>0),\"--\",$I$49)","v":"--"},null,"Rv(impervious)",{"$f":"IF(OR(F13=\"--\",P2>0),\"--\",$E$34)","v":"--"},null,"Rv(impervious)",{"$f":"IF(OR(L48=\"--\",L48=\"x\"),L48,IF($F$26-$F$19<=0,\"--\",$H$34))","v":"--"}]
["% Impervious",{"$f":"IF(OR(B42=\"--\",B42=\"x\"),B42,IFERROR(B48/B51,0))","v":"--"},{"$f":"IF(OR(C42=\"--\",C42=\"x\"),C42,IFERROR(C48/C51,0))","v":"--"},null,"% Impervious",{"$f":"IF(OR(F42=\"--\",F42=\"x\"),F42,($F$48/$F$51))","v":"--"},null,"% Impervious",{"$f":"IF(OR(I42=\"--\",I42=\"x\"),I42,IFERROR($I$48/$I$51,0))","v":"--"}]
["Total Site Area (acres)",{"$f":"IF(OR(B42=\"--\",B42=\"x\"),B42,(B48+B45+B42))","v":"--"},{"$f":"IF(OR(C42=\"--\",C42=\"x\"),C42,(C48+C45+C42))","v":"--"},null,"Final Site Area (acres)",{"$f":"IF(OR(F42=\"--\",F42=\"x\"),F42,$I$51+$L$48)","v":"--"},null,"Total ReDev. Site Area (acres)",{"$f":"IF(OR(I42=\"--\",I42=\"x\"),I42,($I$48+$I$45+$I$42))","v":"--"}]
["Site Rv",{"$f":"IF(OR(B42=\"--\",B42=\"x\"),B42,(B43*B44+B46*B47+B49*B50))","v":"--"},{"$f":"IF(OR(C42=\"--\",C42=\"x\"),C42,(C43*C44+C46*C47+C49*C50))","v":"--"},null,"Final Post Dev Site Rv",{"$f":"IF(OR(F42=\"--\",F42=\"x\"),F42,($F$43*$F$44+$F$46*$F$47+$F$49*$F$50))","v":"--"},null,"ReDev Site Rv",{"$f":"IF(OR(I42=\"--\",I42=\"x\"),I42,($I$43*$I$44+$I$46*$I$47+$I$49*$I$50))","v":"--"}]
["Treatment Volume and Nutrient Load",null,null,null,"Treatment Volume and Nutrient  Load"]
["Pre-ReDevelopment Treatment Volume \n(acre-ft) ",{"$f":"IF(OR(B42=\"--\",B42=\"x\"),B42,(B32*B52*B51/12))","v":"--"},{"$f":"IF(OR(C42=\"--\",C42=\"x\"),C42,(B32*C52*C51/12))","v":"--"},null,"Final Post-Development Treatment Volume               (acre-ft) ",{"$f":"IF(OR(F42=\"--\",F42=\"x\"),F42,($B$32*$F$52*$F$51/12))","v":"--"},null,"Post-ReDevelopment Treatment Volume               (acre-ft) ",{"$f":"IF(OR(I42=\"--\",I42=\"x\"),I42,($B$32*$I$52*$I$51/12))","v":"--"},null,"Post-Development Treatment Volume \n(acre-ft) ",{"$f":"IF(OR(L48=\"--\",L48=\"x\",L48=0),\"--\",($B$32*$L$49*($L$48))/12)","v":"--"}]
["Pre-ReDevelopment Treatment Volume \n(cubic feet) ",{"$f":"IF(OR(B42=\"--\",B42=\"x\"),B42,(B54*43560))","v":"--"},{"$f":"IF(OR(C42=\"--\",C42=\"x\"),C42,(C54*43560))","v":"--"},null,"Final Post-Development Treatment Volume (cubic feet) ",{"$f":"IF(OR(F42=\"--\",F42=\"x\"),F42,($F$54*43560))","v":"--"},null,"Post-ReDevelopment Treatment Volume                  (cubic feet) ",{"$f":"IF(OR(I42=\"--\",I42=\"x\"),I42,($I$54*43560))","v":"--"},null,"Post-Development Treatment Volume (cubic feet) ",{"$f":"IF(F13=\"--\",\"--\",IF(P2>0,\"x\",IF($L$49=\"--\",\"--\",IFERROR($L$54*43560,$O$2))))","v":"--"}]
["Pre-ReDevelopment TP Load                     (lb/yr)",{"$f":"IF(OR(B42=\"--\",B42=\"x\"),B42,(B31*B36*(B54/B32)*B33*2.72))","v":"--"},{"$f":"IF(OR(C42=\"--\",C42=\"x\"),C42,(B31*B36*(C54/B32)*B33*2.72))","v":"--"},{"$f":"IFERROR(IF(OR($C$51=0,$C$56=\"x\",$C$56=\"--\"),\"\",(IF((1-$I$58)*$C$56<($I$51*$B$35),\"*\",\"\"))),\"\")","v":""},"Final Post-Development TP Load                           (lb/yr)",{"$f":"IF(OR(F42=\"--\",F42=\"x\"),F42,($B$31*$B$36*($F$54/$B$32)*$B$33*2.72))","v":"--"},{"$f":"IF($D$56=\"*\",\"*\",\"\")","v":""},"Post-ReDevelopment Load (TP)                           (lb/yr)*",{"$f":"IF(OR(I42=\"--\",I42=\"x\"),I42,($B$31*$B$36*($I$54/$B$32)*$B$33*2.72))","v":"--"},null,"Post-Development TP Load (lb/yr)",{"$f":"IF(OR(L55=\"--\",L55=\"x\"),L55,IF($L$49=\"--\",\"--\",(IF(P2>0,$O$2,($B$31*$B$36*($L$54/$B$32)*$B$33*2.72)))))","v":"--"}]
["Pre-ReDevelopment TP Load per acre\n(lb/acre/yr)",{"$f":"IF(OR(B42=\"--\",B42=\"x\"),B42,IF(B51>0,(ROUND(B56/B51,2)),\"\"))","v":"--"},{"$f":"IF(OR(C42=\"--\",C42=\"x\"),C42,IF(C51>0,(ROUND(C56/C51,2)),\"\"))","v":"--"},{"$f":"IF($D$56=\"*\",\"*\",\"\")","v":""},"Final Post-Development TP Load per acre \n(lb/acre/yr)",{"$f":"IF(OR(F42=\"--\",F42=\"x\"),F42,IF($F$51>0,(ROUND($F$56/$F$51,2)),\"\"))","v":"--"},null,"Post-ReDevelopment TP Load per acre \n(lb/acre/yr)",{"$f":"IF(OR(I42=\"--\",I42=\"x\"),I42,IF($I$51>0,(ROUND($I$56/$I$51,2)),\"\"))","v":"--"}]
["Baseline TP Load (lb/yr)\n(0.41 lbs/acre/yr applied to pre-redevelopment area excluding pervious land proposed for new impervious cover)",null,{"$f":"IF(OR(C42=\"--\",C42=\"x\"),C42,$B$35*C51)","v":"--"},{"$f":"IFERROR(IF(OR(C53=0,C58=\"x\"),\"\",(IF((1-I60)*C58<(I53*B37),\"*\",\"\"))),\"\")","v":""},null,null,null,"Max. Reduction Required \n(Below Pre-ReDevelopment Load)",{"$f":"IF(F10=0,\"--\",IF(E6=\"yes\",20%,IF($F$10<1,10%,20%)))","v":"--"}]
[]
["1Adjusted Land Cover Summary: \nPre ReDevelopment land cover minus pervious land cover (forest/open space or managed turf) acreage proposed for new impervious cover.  \n\nAdjusted total acreage is consistent with Post-ReDevelopment acreage (minus  acreage of new impervious cover).  \n\nColumn I shows load reduction requriement for new impervious cover (based on new development load limit, 0.41 lbs/acre/year). ",null,null,null,{"$f":"IF(P3=1,O3,IF(OR($F$20=0,$F$27=0),\"ENTER ALL AREA INPUTS ABOVE FOR RESULTS\",\"\"))","v":"ENTER ALL AREA INPUTS ABOVE FOR RESULTS"},null,{"$f":"IF($D$56=\"*\",\"*\",\"\")","v":""},"TP Load Reduction Required for Redeveloped Area (lb/yr)",{"$f":"IF(OR(I42=\"--\",I42=\"x\"),I42,(IF((1-I58)*C56<(I51*B35),I56-C51*B35,I56-(1-I58)*C56)))","v":"--"},null,"TP Load Reduction Required for New Impervious Area (lb/yr)",{"$f":"IF(OR(F42=\"--\",F42=\"x\"),F42,IF($L$49=\"--\",\"0\",(L56-L$48*B35)))","v":"--"}]
[null,null,null,null,null,null,{"$f":"IF($D$56=\"*\",\"*\",\"\")","v":""},{"$f":"IF(D56=\"*\",\"Reduction below new development load limitation not required\",\"\")","v":""}]
[null,null,"Post-Development Requirement for Site Area"]
[null,null,null,"TP Load Reduction Required (lb/yr)",null,null,{"$f":"+IF(F13=\"--\",\"--\",IF($E$60=$O$3,$O$3,(IF(P2>0,$O$2,($L$60+$I$60)))))","v":"--"},{"$f":"IF($G$63<0.0049,\"**\",\"\")","v":""},{"$f":"IF(H63=\"**\",\"TP LOAD REDUCTION NOT REQUIRED\",\"\")","v":""}]
[null,null,null,"Linear Project TP Load Reduction Required (lb/yr): ",null,null,{"$f":"+IF(E6=\"yes\",IF(F13=\"--\",\"--\",IF($E$60=$O$3,$O$3,IF(P2>0,$O$2,IF((0.8)*B56<(B51*B35),F56-B51*B35,F56-(0.8)*B56)))),\"N/A\")","v":"N/A"},{"$f":"IF($G$64<0.0049,\"**\",\"\")","v":""},{"$f":"IF(H64=\"**\",\"TP LOAD REDUCTION NOT REQUIRED\",\"\")","v":""}]
[]
[null,"Nitrogen Loads (Informational Purposes Only)"]
[null,"Pre-ReDevelopment TN Load (lb/yr)",null,{"$f":"IF(F13=\"--\",\"--\",IF(P2>0,$O$2,B31*B36*(B54/B32)*B34*2.72))","v":"--"},null,null,"Final Post-Development TN Load\n(Post-ReDevelopment & New Impervious)  (lb/yr)",null,{"$f":"IF(F13=\"--\",\"--\",IF(P2>0,$O$2,B31*B36*((F54)/B32)*B34*2.72))","v":"--"}]

{"sheet":"D.A. A","index":1,"n_rows":278,"n_cols":27,"rows_kept":278,"cut":false,"hidden":false,"merged":[[6,7,6,11],[54,13,54,14],[7,8,7,11],[0,3,0,4],[51,16,51,19],[21,13,21,14],[53,13,53,14],[44,13,44,14],[45,13,45,14],[22,13,22,14],[36,13,36,14],[37,13,37,14],[52,13,52,14],[40,13,40,14],[49,13,49,14],[41,13,41,14],[10,13,10,14],[33,13,33,14],[17,13,17,14],[13,13,13,14],[23,13,23,14],[24,13,24,14],[18,13,18,14],[12,13,12,14],[31,13,31,14],[28,13,28,14],[16,13,16,14],[32,13,32,14],[19,13,19,14],[27,13,27,14],[20,13,20,14],[48,13,48,14],[69,15,69,16],[90,13,90,14],[71,13,71,14],[85,13,85,14],[83,13,83,14],[75,13,75,14],[74,16,74,18],[82,16,82,17],[88,17,88,19],[80,13,80,14],[79,13,79,14],[76,13,76,14],[72,13,72,14],[70,17,70,19],[91,13,91,14],[84,13,84,14],[89,13,89,14],[86,13,86,14],[69,1,69,2],[88,0,88,1]]}
["Drainage Area A"]
[null,null,null,null,null,null,null,null,null,null,null,null,null,null,null,null,null,null,null,null,null,null,null,null,"Check Areas!",null,"CHECK AREAS!"]
["Drainage Area A Land Cover  (acres)",{"$f":"IF($F$8>Site!$F$27,\"Drainage area is greater than site area!\",(IF(OR(F5>Site!F24,F6>Site!F25,F7>Site!F26),\"Check Site Tab land cover areas!\",\"\")))","v":""}]
[null,"A Soils","B Soils","C Soils","D Soils","Totals","Land Cover Rv",null,null,null,null,null,null,"`"]
["Forest/Open Space (acres)",null,null,null,null,{"$f":"SUMIF(B5:E5,\">=0\")","v":0},{"$f":"IF(F5>0,(B5*Site!E32+C5*Site!F32+D5*Site!G32+E5*Site!H32)/F5,0)","v":0}]
["Managed Turf (acres)",null,null,null,null,{"$f":"SUMIF(B6:E6,\">=0\")","v":0},{"$f":"IF(F6>0,(B6*Site!E33+C6*Site!F33+D6*Site!G33+E6*Site!H33)/F6,0)","v":0}]
["Impervious Cover (acres) ",null,null,null,null,{"$f":"SUMIF(B7:E7,\">=0\")","v":0},{"$f":"IF(F7>0,((B7*Site!E34+C7*Site!F34+D7*Site!G34+E7*Site!H34)/F7),0)","v":0},"     Total Phosphorus Available for Removal in D.A. A (lb/yr)",null,null,null,null,{"$f":"Site!$B$31*Site!$B$36*($M$8/Site!$B$32)*Site!$B$33*2.72/43560","v":0}]
[null,null,null,null,"Total",{"$f":"SUM(F5:F7)","v":0},null,null,"Post Development Treatment Volume in D.A. A (ft3)",null,null,null,{"$f":"IFERROR(Site!B32/12*(F6*G6+F7*G7)/(F6+F7)*(F6+F7)*43560,0)","v":0}]
[]
["Stormwater Best Management Practices (RR = Runoff Reduction)",null,null,null,null,null,null,null,null,null,null,null,null,"--Select from dropdown lists--"]
["Practice","Runoff Reduction Credit (%)","Managed Turf Credit Area (acres) ","Impervious Cover Credit Area (acres)","Volume from Upstream Practice (ft3)","Runoff Reduction (ft3)","Remaining Runoff Volume  (ft3)","Total BMP Treatment Volume (ft3)","Phosphorus Removal Efficiency (%)","Phosphorus Load from Upstream Practices (lb)","Untreated Phosphorus Load to Practice (lb)","Phosphorus Removed By Practice (lb)","Remaining Phosphorus Load (lb)","Downstream Practice to be Employed",null,null,"Nitrogen Removal Efficiency (%)","Nitrogen Load from Upstream  Practices (lbs)","Untreated Nitrogen Load to Practice (lbs)","Nitrogen Removed By Practice (lbs)","Remaining Nitrogen Load (lbs)"]
["1. Vegetated Roof (RR)",null,null,null,null,null,null,null,null,null,null,null,null,null,null,null,"1. Vegetated Roof (RR)"]
["1.a. Vegetated Roof #1 (Spec #5)",45,null,null,null,{"$f":"(Site!$B$32*($G$7*$D13)*3630)*$B13/100","v":0},{"$f":"(Site!$B$32*($G$7*$D13)*3630)*(1-$B13/100)","v":0},{"$f":"+$F13+$G13","v":0},0,null,{"$f":"(Site!$B$32*($G$7*$D13)*3630)*Site!$B$33*0.3048^3/454*Site!$B$31/Site!$B$32*Site!$B$36","v":0},{"$f":"IFERROR($K13*($F13+$G13*$I13/100)/($H13),0)","v":0},{"$f":"$K13-$L13","v":0},null,null,null,0,null,{"$f":"(Site!$B$32*$G$7*$D13*3630)*Site!$B$34*0.3048^3/454*Site!$B$31/Site!$B$32*Site!$B$36","v":0},{"$f":"IFERROR($S13*($F13+$G13*$Q13/100)/$H13,0)","v":0},{"$f":"$S13-$T13","v":0}]
["1.b. Vegetated Roof #2 (Spec #5)",60,null,null,null,{"$f":"(Site!$B$32*($G$7*$D14)*3630)*$B14/100","v":0},{"$f":"(Site!$B$32*($G$7*$D14)*3630)*(1-$B14/100)","v":0},{"$f":"+$F14+$G14","v":0},0,null,{"$f":"(Site!$B$32*($G$7*$D14)*3630)*Site!$B$33*0.3048^3/454*Site!$B$31/Site!$B$32*Site!$B$36","v":0},{"$f":"IFERROR($K14*($F14+$G14*$I14/100)/($H14),0)","v":0},{"$f":"$K14-$L14","v":0},null,null,null,0,null,{"$f":"(Site!$B$32*$G$7*$D14*3630)*Site!$B$34*0.3048^3/454*Site!$B$31/Site!$B$32*Site!$B$36","v":0},{"$f":"IFERROR($S14*($F14+$G14*$Q14/100)/$H14,0)","v":0},{"$f":"$S14-$T14","v":0}]
[]
["2. Rooftop Disconnection (RR)",null,null,null,null,null,null,null,null,null,null,null,null,null,null,null,"2. Rooftop Disconnection (RR)"]
["2.a. Simple Disconnection to A/B Soils \n(Spec #1)",50,null,null,{"$f":"SUMIF($N$13:$N$92,$P121,$G$13:$G$92)","v":0},{"$f":"(Site!$B$32*($G$6*$C17+$G$7*$D17)*3630+$E17)*$B17/100","v":0},{"$f":"(Site!$B$32*($G$6*$C17+$G$7*$D17)*3630+$E17)*(1-$B17/100)","v":0},{"$f":"+$F17+$G17","v":0},0,{"$f":"SUMIF($N$13:$N$92,$P121,$M$13:$M$92)","v":0},{"$f":"(Site!$B$32*($G$6*$C17+$G$7*$D17)*3630)*Site!$B$33*0.3048^3/454*Site!$B$31/Site!$B$32*Site!$B$36","v":0},{"$f":"IFERROR(($J17+$K17)*($F17+$G17*$I17/100)/$H17,0)","v":0},{"$f":"$J17+$K17-$L17","v":0},null,null,null,0,{"$f":"SUMIF($N$13:$N$92,$P121,$U$13:$U$92)","v":0},{"$f":"(Site!$B$32*$G$7*$D17*3630)*Site!$B$34*0.3048^3/454*Site!$B$31/Site!$B$32*Site!$B$36","v":0},{"$f":"IFERROR(($R17+$S17)*($F17+$G17*$Q17/100)/$H17,0)","v":0},{"$f":"$R17+$S17-$T17","v":0}]
["2.b. Simple Disconnection to C/D Soils \n(Spec #1)",25,null,null,{"$f":"SUMIF($N$13:$N$92,$P122,$G$13:$G$92)","v":0},{"$f":"(Site!$B$32*($G$6*$C18+$G$7*$D18)*3630+$E18)*$B18/100","v":0},{"$f":"(Site!$B$32*($G$6*$C18+$G$7*$D18)*3630+$E18)*(1-$B18/100)","v":0},{"$f":"+$F18+$G18","v":0},0,{"$f":"SUMIF($N$13:$N$92,$P122,$M$13:$M$92)","v":0},{"$f":"(Site!$B$32*($G$6*$C18+$G$7*$D18)*3630)*Site!$B$33*0.3048^3/454*Site!$B$31/Site!$B$32*Site!$B$36","v":0},{"$f":"IFERROR(($J18+$K18)*($F18+$G18*$I18/100)/$H18,0)","v":0},0,null,null,null,0,{"$f":"SUMIF($N$13:$N$92,$P122,$U$13:$U$92)","v":0},{"$f":"(Site!$B$32*$G$7*$D18*3630)*Site!$B$34*0.3048^3/454*Site!$B$31/Site!$B$32*Site!$B$36","v":0},{"$f":"IFERROR(($R18+$S18)*($F18+$G18*$Q18/100)/$H18,0)","v":0},0]
["2.c. To Soil Amended Filter Path as per specifications (existing C/D soils) (Spec #4)",50,null,null,0,{"$f":"(Site!$B$32*($G$6*$C19+$G$7*$D19)*3630+$E19)*$B19/100","v":0},{"$f":"(Site!$B$32*($G$6*$C19+$G$7*$D19)*3630+$E19)*(1-$B19/100)","v":0},0,0,0,{"$f":"(Site!$B$32*($G$6*$C19+$G$7*$D19)*3630)*Site!$B$33*0.3048^3/454*Site!$B$31/Site!$B$32*Site!$B$36","v":0},0,0,null,null,null,0,0,{"$f":"(Site!$B$32*$G$7*$D19*3630)*Site!$B$34*0.3048^3/454*Site!$B$31/Site!$B$32*Site!$B$36","v":0},0,0]
["2.d. To Dry Well or French Drain #1, \nMicro-Infilration #1 (Spec #8)",50,null,null,0,{"$f":"(Site!$B$32*($G$6*$C20+$G$7*$D20)*3630+$E20)*$B20/100","v":0},{"$f":"(Site!$B$32*($G$6*$C20+$G$7*$D20)*3630+$E20)*(1-$B20/100)","v":0},0,25,0,{"$f":"(Site!$B$32*($G$6*$C20+$G$7*$D20)*3630)*Site!$B$33*0.3048^3/454*Site!$B$31/Site!$B$32*Site!$B$36","v":0},0,0,null,null,null,15,0,{"$f":"(Site!$B$32*$G$7*$D20*3630)*Site!$B$34*0.3048^3/454*Site!$B$31/Site!$B$32*Site!$B$36","v":0},0,0]
["2.e. To Dry Well or French Drain #2, \nMicro-Infiltration #2 (Spec #8)",90,null,null,0,{"$f":"(Site!$B$32*($G$6*$C21+$G$7*$D21)*3630+$E21)*$B21/100","v":0},{"$f":"(Site!$B$32*($G$6*$C21+$G$7*$D21)*3630+$E21)*(1-$B21/100)","v":0},0,25,0,{"$f":"(Site!$B$32*($G$6*$C21+$G$7*$D21)*3630)*Site!$B$33*0.3048^3/454*Site!$B$31/Site!$B$32*Site!$B$36","v":0},0,0,null,null,null,15,0,{"$f":"(Site!$B$32*$G$7*$D21*3630)*Site!$B$34*0.3048^3/454*Site!$B$31/Site!$B$32*Site!$B$36","v":0},0,0]
["2.f. To Rain Garden #1, \nMicro-Bioretention #1 (Spec #9)",40,null,null,0,{"$f":"(Site!$B$32*($G$6*$C22+$G$7*$D22)*3630+$E22)*$B22/100","v":0},{"$f":"(Site!$B$32*($G$6*$C22+$G$7*$D22)*3630+$E22)*(1-$B22/100)","v":0},0,25,0,{"$f":"(Site!$B$32*($G$6*$C22+$G$7*$D22)*3630)*Site!$B$33*0.3048^3/454*Site!$B$31/Site!$B$32*Site!$B$36","v":0},0,0,null,null,null,40,0,{"$f":"(Site!$B$32*$G$7*$D22*3630)*Site!$B$34*0.3048^3/454*Site!$B$31/Site!$B$32*Site!$B$36","v":0},0,0]
["2.g. To Rain Garden #2, \nMicro-Bioretention #2 (Spec #9)",80,null,null,0,{"$f":"(Site!$B$32*($G$6*$C23+$G$7*$D23)*3630+$E23)*$B23/100","v":0},{"$f":"(Site!$B$32*($G$6*$C23+$G$7*$D23)*3630+$E23)*(1-$B23/100)","v":0},0,50,0,{"$f":"(Site!$B$32*($G$6*$C23+$G$7*$D23)*3630)*Site!$B$33*0.3048^3/454*Site!$B$31/Site!$B$32*Site!$B$36","v":0},0,0,null,null,null,60,0,{"$f":"(Site!$B$32*$G$7*$D23*3630)*Site!$B$34*0.3048^3/454*Site!$B$31/Site!$B$32*Site!$B$36","v":0},0,0]
["2.h. To Rainwater Harvesting (Spec #6)",0,null,null,0,{"$f":"(Site!$B$32*($G$6*$C24+$G$7*$D24)*3630+$E24)*$B24/100","v":0},{"$f":"(Site!$B$32*($G$6*$C24+$G$7*$D24)*3630+$E24)*(1-$B24/100)","v":0},0,0,0,{"$f":"(Site!$B$32*($G$6*$C24+$G$7*$D24)*3630)*Site!$B$33*0.3048^3/454*Site!$B$31/Site!$B$32*Site!$B$36","v":0},0,0,null,null,null,0,0,{"$f":"(Site!$B$32*$G$7*$D24*3630)*Site!$B$34*0.3048^3/454*Site!$B$31/Site!$B$32*Site!$B$36","v":0},0,0]
["2.i. To Stormwater Planter, \nUrban Bioretention (Spec #9, Appendix A)",40,null,null,0,{"$f":"(Site!$B$32*($G$6*$C25+$G$7*$D25)*3630+$E25)*$B25/100","v":0},{"$f":"(Site!$B$32*($G$6*$C25+$G$7*$D25)*3630+$E25)*(1-$B25/100)","v":0},0,25,0,{"$f":"(Site!$B$32*($G$6*$C25+$G$7*$D25)*3630)*Site!$B$33*0.3048^3/454*Site!$B$31/Site!$B$32*Site!$B$36","v":0},0,0,null,null,null,40,0,{"$f":"(Site!$B$32*$G$7*$D25*3630)*Site!$B$34*0.3048^3/454*Site!$B$31/Site!$B$32*Site!$B$36","v":0},0,0]
[]
["3. Permeable Pavement  (RR)",null,null,null,null,null,null,null,null,null,null,null,null,null,null,null,"3. Permeable Pavement  (RR)"]
["3.a. Permeable Pavement #1 (Spec #7)",45,null,null,{"$f":"SUMIF($N$13:$N$92,$P130,$G$13:$G$92)","v":0},{"$f":"(Site!$B$32*($G$6*$C28+$G$7*$D28)*3630+$E28)*$B28/100","v":0},{"$f":"(Site!$B$32*($G$6*$C28+$G$7*$D28)*3630+$E28)*(1-$B28/100)","v":0},{"$f":"+$F28+$G28","v":0},25,{"$f":"SUMIF($N$13:$N$92,$P130,$M$13:$M$92)","v":0},{"$f":"(Site!$B$32*($G$6*$C28+$G$7*$D28)*3630)*Site!$B$33*0.3048^3/454*Site!$B$31/Site!$B$32*Site!$B$36","v":0},{"$f":"IFERROR(($J28+$K28)*($F28+$G28*$I28/100)/$H28,0)","v":0},{"$f":"$J28+$K28-$L28","v":0},null,null,null,25,{"$f":"SUMIF($N$13:$N$92,$P130,$U$13:$U$92)","v":0},{"$f":"(Site!$B$32*($G$6*$C28+$G$7*$D28)*3630)*Site!$B$34*0.3048^3/454*Site!$B$31/Site!$B$32*Site!$B$36","v":0},{"$f":"IFERROR(($R28+$S28)*($F28+$G28*$Q28/100)/$H28,0)","v":0},{"$f":"$R28+$S28-$T28","v":0}]
["3.b. Permeable Pavement #2 (Spec #7)",75,null,null,null,{"$f":"(Site!$B$32*($G$6*$C29+$G$7*$D29)*3630+$E29)*$B29/100","v":0},{"$f":"(Site!$B$32*($G$6*$C29+$G$7*$D29)*3630+$E29)*(1-$B29/100)","v":0},{"$f":"+$F29+$G29","v":0},25,null,{"$f":"(Site!$B$32*($G$6*$C29+$G$7*$D29)*3630)*Site!$B$33*0.3048^3/454*Site!$B$31/Site!$B$32*Site!$B$36","v":0},{"$f":"IFERROR(($J29+$K29)*($F29+$G29*$I29/100)/$H29,0)","v":0},{"$f":"$K29-$L29","v":0},null,null,null,25,null,{"$f":"(Site!$B$32*$G$7*$D29*3630)*Site!$B$34*0.3048^3/454*Site!$B$31/Site!$B$32*Site!$B$36","v":0},{"$f":"IFERROR(($R29+$S29)*($F29+$G29*$Q29/100)/$H29,0)","v":0},{"$f":"$R29+$S29-$T29","v":0}]
[]
["4. Grass Channel (RR)",null,null,null,null,null,null,null,null,null,null,null,null,null,null,null,"4. Grass Channel (RR)"]
["4.a. Grass Channel A/B Soils (Spec #3)",20,null,null,{"$f":"SUMIF($N$13:$N$92,$P131,$G$13:$G$92)","v":0},{"$f":"(Site!$B$32*($G$6*$C32+$G$7*$D32)*3630+$E32)*$B32/100","v":0},{"$f":"(Site!$B$32*($G$6*$C32+$G$7*$D32)*3630+$E32)*(1-$B32/100)","v":0},{"$f":"+$F32+$G32","v":0},15,{"$f":"SUMIF($N$13:$N$92,$P131,$M$13:$M$92)","v":0},{"$f":"(Site!$B$32*($G$6*$C32+$G$7*$D32)*3630)*Site!$B$33*0.3048^3/454*Site!$B$31/Site!$B$32*Site!$B$36","v":0},{"$f":"IFERROR(($J32+$K32)*($F32+$G32*$I32/100)/$H32,0)","v":0},{"$f":"$J32+$K32-$L32","v":0},null,null,null,20,{"$f":"SUMIF($N$13:$N$92,$P131,$U$13:$U$92)","v":0},{"$f":"(Site!$B$32*($G$6*$C32+$G$7*$D32)*3630)*Site!$B$34*0.3048^3/454*Site!$B$31/Site!$B$32*Site!$B$36","v":0},{"$f":"IFERROR(($R32+$S32)*($F32+$G32*$Q32/100)/$H32,0)","v":0},{"$f":"$R32+$S32-$T32","v":0}]
["4.b. Grass Channel C/D Soils (Spec #3)",10,null,null,{"$f":"SUMIF($N$13:$N$92,$P132,$G$13:$G$92)","v":0},{"$f":"(Site!$B$32*($G$6*$C33+$G$7*$D33)*3630+$E33)*$B33/100","v":0},{"$f":"(Site!$B$32*($G$6*$C33+$G$7*$D33)*3630+$E33)*(1-$B33/100)","v":0},{"$f":"+$F33+$G33","v":0},15,{"$f":"SUMIF($N$13:$N$92,$P132,$M$13:$M$92)","v":0},{"$f":"(Site!$B$32*($G$6*$C33+$G$7*$D33)*3630)*Site!$B$33*0.3048^3/454*Site!$B$31/Site!$B$32*Site!$B$36","v":0},{"$f":"IFERROR(($J33+$K33)*($F33+$G33*$I33/100)/$H33,0)","v":0},{"$f":"$J33+$K33-$L33","v":0},null,null,null,20,{"$f":"SUMIF($N$13:$N$92,$P132,$U$13:$U$92)","v":0},{"$f":"(Site!$B$32*($G$6*$C33+$G$7*$D33)*3630)*Site!$B$34*0.3048^3/454*Site!$B$31/Site!$B$32*Site!$B$36","v":0},{"$f":"IFERROR(($R33+$S33)*($F33+$G33*$Q33/100)/$H33,0)","v":0},{"$f":"$R33+$S33-$T33","v":0}]
["4.c. Grass Channel with Compost Amended Soils as per specs (see Spec #4)",{"$f":"IF(Site!$J$11=\"2011 Stds & Specs\",30,20)","v":20},null,null,0,{"$f":"(Site!$B$32*($G$6*$C34+$G$7*$D34)*3630+$E34)*$B34/100","v":0},{"$f":"(Site!$B$32*($G$6*$C34+$G$7*$D34)*3630+$E34)*(1-$B34/100)","v":0},0,15,{"$f":"SUMIF($N$13:$N$92,$P133,$M$13:$M$92)","v":0},{"$f":"(Site!$B$32*($G$6*$C34+$G$7*$D34)*3630)*Site!$B$33*0.3048^3/454*Site!$B$31/Site!$B$32*Site!$B$36","v":0},0,0,null,null,null,20,0,{"$f":"(Site!$B$32*($G$6*$C34+$G$7*$D34)*3630)*Site!$B$34*0.3048^3/454*Site!$B$31/Site!$B$32*Site!$B$36","v":0},0,0]
[null,null,null,null,null,null,null,null,null,null,null,null,null,null,null,null,null,null,null,null,null,null,"`"]
["5. Dry Swale (RR)",null,null,null,null,null,null,null,null,null,null,null,null,null,null,null,"5. Dry Swale (RR)"]
["5.a. Dry Swale #1 (Spec #10)",40,null,null,{"$f":"SUMIF($N$13:$N$92,$P134,$G$13:$G$92)","v":0},{"$f":"(Site!$B$32*($G$6*$C37+$G$7*$D37)*3630+$E37)*$B37/100","v":0},{"$f":"(Site!$B$32*($G$6*$C37+$G$7*$D37)*3630+$E37)*(1-$B37/100)","v":0},{"$f":"+$F37+$G37","v":0},20,{"$f":"SUMIF($N$13:$N$92,$P134,$M$13:$M$92)","v":0},{"$f":"(Site!$B$32*($G$6*$C37+$G$7*$D37)*3630)*Site!$B$33*0.3048^3/454*Site!$B$31/Site!$B$32*Site!$B$36","v":0},{"$f":"IFERROR(($J37+$K37)*($F37+$G37*$I37/100)/$H37,0)","v":0},{"$f":"$J37+$K37-$L37","v":0},null,null,null,25,{"$f":"SUMIF($N$13:$N$92,$P134,$U$13:$U$92)","v":0},{"$f":"(Site!$B$32*($G$6*$C37+$G$7*$D37)*3630)*Site!$B$34*0.3048^3/454*Site!$B$31/Site!$B$32*Site!$B$36","v":0},{"$f":"IFERROR(($R37+$S37)*($F37+$G37*$Q37/100)/$H37,0)","v":0},{"$f":"$R37+$S37-$T37","v":0}]
["5.b. Dry Swale #2 (Spec #10)",60,null,null,{"$f":"SUMIF($N$13:$N$92,$P135,$G$13:$G$92)","v":0},{"$f":"(Site!$B$32*($G$6*$C38+$G$7*$D38)*3630+$E38)*$B38/100","v":0},{"$f":"(Site!$B$32*($G$6*$C38+$G$7*$D38)*3630+$E38)*(1-$B38/100)","v":0},{"$f":"+$F38+$G38","v":0},40,{"$f":"SUMIF($N$13:$N$92,$P135,$M$13:$M$92)","v":0},{"$f":"(Site!$B$32*($G$6*$C38+$G$7*$D38)*3630)*Site!$B$33*0.3048^3/454*Site!$B$31/Site!$B$32*Site!$B$36","v":0},{"$f":"IFERROR(($J38+$K38)*($F38+$G38*$I38/100)/$H38,0)","v":0},{"$f":"$J38+$K38-$L38","v":0},null,null,null,35,{"$f":"SUMIF($N$13:$N$92,$P135,$U$13:$U$92)","v":0},{"$f":"(Site!$B$32*($G$6*$C38+$G$7*$D38)*3630)*Site!$B$34*0.3048^3/454*Site!$B$31/Site!$B$32*Site!$B$36","v":0},0,0]
[]
["6. Bioretention (RR)",null,null,null,null,null,null,null,null,null,null,null,null,null,null,null,"6. Bioretention (RR)"]
["6.a. Bioretention #1 or Micro-Bioretention #1 or Urban Bioretention (Spec #9)",40,null,null,{"$f":"SUMIF($N$13:$N$92,$P136,$G$13:$G$92)","v":0},{"$f":"(Site!$B$32*($G$6*$C41+$G$7*$D41)*3630+$E41)*$B41/100","v":0},{"$f":"(Site!$B$32*($G$6*$C41+$G$7*$D41)*3630+$E41)*(1-$B41/100)","v":0},{"$f":"+$F41+$G41","v":0},25,{"$f":"SUMIF($N$13:$N$92,$P136,$M$13:$M$92)","v":0},{"$f":"(Site!$B$32*($G$6*$C41+$G$7*$D41)*3630)*Site!$B$33*0.3048^3/454*Site!$B$31/Site!$B$32*Site!$B$36","v":0},{"$f":"IFERROR(($J41+$K41)*($F41+$G41*$I41/100)/$H41,0)","v":0},{"$f":"$J41+$K41-$L41","v":0},null,null,null,40,{"$f":"SUMIF($N$13:$N$92,$P136,$U$13:$U$92)","v":0},{"$f":"(Site!$B$32*($G$6*$C41+$G$7*$D41)*3630)*Site!$B$34*0.3048^3/454*Site!$B$31/Site!$B$32*Site!$B$36","v":0},{"$f":"IFERROR(($R41+$S41)*($F41+$G41*$Q41/100)/$H41,0)","v":0},{"$f":"$R41+$S41-$T41","v":0}]
["6.b. Bioretention #2 or Micro-Bioretention #2 (Spec #9)",80,null,null,{"$f":"SUMIF($N$13:$N$92,$P137,$G$13:$G$92)","v":0},{"$f":"(Site!$B$32*($G$6*$C42+$G$7*$D42)*3630+$E42)*$B42/100","v":0},{"$f":"(Site!$B$32*($G$6*$C42+$G$7*$D42)*3630+$E42)*(1-$B42/100)","v":0},{"$f":"+$F42+$G42","v":0},50,{"$f":"SUMIF($N$13:$N$92,$P137,$M$13:$M$92)","v":0},{"$f":"(Site!$B$32*($G$6*$C42+$G$7*$D42)*3630)*Site!$B$33*0.3048^3/454*Site!$B$31/Site!$B$32*Site!$B$36","v":0},{"$f":"IFERROR(($J42+$K42)*($F42+$G42*$I42/100)/$H42,0)","v":0},{"$f":"$J42+$K42-$L42","v":0},null,null,null,60,{"$f":"SUMIF($N$13:$N$92,$P137,$U$13:$U$92)","v":0},{"$f":"(Site!$B$32*($G$6*$C42+$G$7*$D42)*3630)*Site!$B$34*0.3048^3/454*Site!$B$31/Site!$B$32*Site!$B$36","v":0},0,0]
[]
["7. Infiltration (RR)",null,null,null,null,null,null,null,null,null,null,null,null,null,null,null,"7. Infiltration (RR)"]
["7.a. Infiltration #1 (Spec #8)",50,null,null,{"$f":"SUMIF($N$13:$N$92,$P138,$G$13:$G$92)","v":0},{"$f":"(Site!$B$32*($G$6*$C45+$G$7*$D45)*3630+$E45)*$B45/100","v":0},{"$f":"(Site!$B$32*($G$6*$C45+$G$7*$D45)*3630+$E45)*(1-$B45/100)","v":0},{"$f":"+$F45+$G45","v":0},25,{"$f":"SUMIF($N$13:$N$92,$P138,$M$13:$M$92)","v":0},{"$f":"(Site!$B$32*($G$6*$C45+$G$7*$D45)*3630)*Site!$B$33*0.3048^3/454*Site!$B$31/Site!$B$32*Site!$B$36","v":0},{"$f":"IFERROR(($J45+$K45)*($F45+$G45*$I45/100)/$H45,0)","v":0},{"$f":"$J45+$K45-$L45","v":0},null,null,null,15,{"$f":"SUMIF($N$13:$N$92,$P138,$U$13:$U$92)","v":0},{"$f":"(Site!$B$32*($G$6*$C45+$G$7*$D45)*3630)*Site!$B$34*0.3048^3/454*Site!$B$31/Site!$B$32*Site!$B$36","v":0},{"$f":"IFERROR(($R45+$S45)*($F45+$G45*$Q45/100)/$H45,0)","v":0},{"$f":"$R45+$S45-$T45","v":0}]
["7.b. Infiltration #2 (Spec #8)",90,null,null,{"$f":"SUMIF($N$13:$N$92,$P139,$G$13:$G$92)","v":0},{"$f":"(Site!$B$32*($G$6*$C46+$G$7*$D46)*3630+$E46)*$B46/100","v":0},{"$f":"(Site!$B$32*($G$6*$C46+$G$7*$D46)*3630+$E46)*(1-$B46/100)","v":0},{"$f":"+$F46+$G46","v":0},25,{"$f":"SUMIF($N$13:$N$92,$P139,$M$13:$M$92)","v":0},{"$f":"(Site!$B$32*($G$6*$C46+$G$7*$D46)*3630)*Site!$B$33*0.3048^3/454*Site!$B$31/Site!$B$32*Site!$B$36","v":0},{"$f":"IFERROR(($J46+$K46)*($F46+$G46*$I46/100)/$H46,0)","v":0},{"$f":"$J46+$K46-$L46","v":0},null,null,null,15,{"$f":"SUMIF($N$13:$N$92,$P139,$U$13:$U$92)","v":0},{"$f":"(Site!$B$32*($G$6*$C46+$G$7*$D46)*3630)*Site!$B$34*0.3048^3/454*Site!$B$31/Site!$B$32*Site!$B$36","v":0},0,0]
[]
["8. Extended Detention Pond (RR)",null,null,null,null,null,null,null,null,null,null,null,null,null,null,null,"8. Extended Detention Pond (RR)"]
["8.a. ED #1 (Spec #15)",0,null,null,{"$f":"SUMIF($N$13:$N$92,$P140,$G$13:$G$92)","v":0},{"$f":"(Site!$B$32*($G$6*$C49+$G$7*$D49)*3630+$E49)*$B49/100","v":0},{"$f":"(Site!$B$32*($G$6*$C49+$G$7*$D49)*3630+$E49)*(1-$B49/100)","v":0},{"$f":"+$F49+$G49","v":0},15,{"$f":"SUMIF($N$13:$N$92,$P140,$M$13:$M$92)","v":0},{"$f":"(Site!$B$32*($G$6*$C49+$G$7*$D49)*3630)*Site!$B$33*0.3048^3/454*Site!$B$31/Site!$B$32*Site!$B$36","v":0},{"$f":"IFERROR(($J49+$K49)*($F49+$G49*$I49/100)/$H49,0)","v":0},{"$f":"$J49+$K49-$L49","v":0},null,null,null,10,{"$f":"SUMIF($N$13:$N$92,$P140,$U$13:$U$92)","v":0},{"$f":"(Site!$B$32*($G$6*$C49+$G$7*$D49)*3630)*Site!$B$34*0.3048^3/454*Site!$B$31/Site!$B$32*Site!$B$36","v":0},{"$f":"IFERROR(($R49+$S49)*($F49+$G49*$Q49/100)/$H49,0)","v":0},{"$f":"$R49+$S49-$T49","v":0}]
["8.b. ED #2 (Spec #15)",15,null,null,{"$f":"SUMIF($N$13:$N$92,$P141,$G$13:$G$92)","v":0},{"$f":"(Site!$B$32*($G$6*$C50+$G$7*$D50)*3630+$E50)*$B50/100","v":0},{"$f":"(Site!$B$32*($G$6*$C50+$G$7*$D50)*3630+$E50)*(1-$B50/100)","v":0},{"$f":"+$F50+$G50","v":0},15,{"$f":"SUMIF($N$13:$N$92,$P141,$M$13:$M$92)","v":0},{"$f":"(Site!$B$32*($G$6*$C50+$G$7*$D50)*3630)*Site!$B$33*0.3048^3/454*Site!$B$31/Site!$B$32*Site!$B$36","v":0},0,0,null,null,null,10,{"$f":"SUMIF($N$13:$N$92,$P141,$U$13:$U$92)","v":0},{"$f":"(Site!$B$32*($G$6*$C50+$G$7*$D50)*3630)*Site!$B$34*0.3048^3/454*Site!$B$31/Site!$B$32*Site!$B$36","v":0},0,0]
[]
["9. Sheetflow to Filter/Open Space (RR)",null,null,null,null,null,null,null,null,null,null,null,null,null,null,null,"9. Sheetflow to Filter/Open Space (RR)"]
["9.a. Sheetflow to Conservation Area, A/B Soils (Spec #2)",75,null,null,{"$f":"SUMIF($N$13:$N$92,$P142,$G$13:$G$92)","v":0},{"$f":"(Site!$B$32*($G$6*$C53+$G$7*$D53)*3630+$E53)*$B53/100","v":0},{"$f":"(Site!$B$32*($G$6*$C53+$G$7*$D53)*3630+$E53)*(1-$B53/100)","v":0},{"$f":"+$F53+$G53","v":0},0,{"$f":"SUMIF($N$13:$N$92,$P142,$M$13:$M$92)","v":0},{"$f":"(Site!$B$32*($G$6*$C53+$G$7*$D53)*3630)*Site!$B$33*0.3048^3/454*Site!$B$31/Site!$B$32*Site!$B$36","v":0},{"$f":"IFERROR(($J53+$K53)*($F53+$G53*$I53/100)/$H53,0)","v":0},{"$f":"$J53+$K53-$L53","v":0},null,null,null,0,{"$f":"SUMIF($N$13:$N$92,$P142,$U$13:$U$92)","v":0},{"$f":"(Site!$B$32*($G$6*$C53+$G$7*$D53)*3630)*Site!$B$34*0.3048^3/454*Site!$B$31/Site!$B$32*Site!$B$36","v":0},{"$f":"IFERROR(($R53+$S53)*($F53+$G53*$Q53/100)/$H53,0)","v":0},{"$f":"$R53+$S53-$T53","v":0}]
["9.b. Sheetflow to Conservation Area, C/D Soils (Spec #2)",50,null,null,{"$f":"SUMIF($N$13:$N$92,$P143,$G$13:$G$92)","v":0},{"$f":"(Site!$B$32*($G$6*$C54+$G$7*$D54)*3630+$E54)*$B54/100","v":0},{"$f":"(Site!$B$32*($G$6*$C54+$G$7*$D54)*3630+$E54)*(1-$B54/100)","v":0},{"$f":"+$F54+$G54","v":0},0,{"$f":"SUMIF($N$13:$N$92,$P143,$M$13:$M$92)","v":0},{"$f":"(Site!$B$32*($G$6*$C54+$G$7*$D54)*3630)*Site!$B$33*0.3048^3/454*Site!$B$31/Site!$B$32*Site!$B$36","v":0},0,0,null,null,null,0,{"$f":"SUMIF($N$13:$N$92,$P143,$U$13:$U$92)","v":0},{"$f":"(Site!$B$32*($G$6*$C54+$G$7*$D54)*3630)*Site!$B$34*0.3048^3/454*Site!$B$31/Site!$B$32*Site!$B$36","v":0},0,0]
["9.c. Sheetflow to Vegetated Filter Strip, A Soils or Compost Amended B/C/D Soils \n(Spec #2 & #4)",50,null,null,0,{"$f":"(Site!$B$32*($G$6*$C55+$G$7*$D55)*3630+$E55)*$B55/100","v":0},{"$f":"(Site!$B$32*($G$6*$C55+$G$7*$D55)*3630+$E55)*(1-$B55/100)","v":0},0,0,0,{"$f":"(Site!$B$32*($G$6*$C55+$G$7*$D55)*3630)*Site!$B$33*0.3048^3/454*Site!$B$31/Site!$B$32*Site!$B$36","v":0},0,0,null,null,null,0,0,{"$f":"(Site!$B$32*($G$6*$C55+$G$7*$D55)*3630)*Site!$B$34*0.3048^3/454*Site!$B$31/Site!$B$32*Site!$B$36","v":0},0,0]
[]
[]
[null,null,null,null,"TOTAL IMPERVIOUS COVER TREATED (ac)",{"$f":"SUM(D13:D55)","v":0},"AREA CHECK:",{"$f":"IF(F58>$F$7,\"AREA EXCEEDED!\",\"OK.\")","v":"OK."}]
[null,null,null,null,"TOTAL MANAGED TURF AREA TREATED (ac)",{"$f":"SUM(C32:C55)","v":0},"AREA CHECK:",{"$f":"IF(F59>$F$6,\"AREA EXCEEDED!\",\"OK.\")","v":"OK."}]
[null,null,null,null,"TOTAL RUNOFF REDUCTION IN D.A. A (ft3)",{"$f":"IFERROR(SUM($F$13:$F$55),0)","v":0}]
[]
[null,null,null,null,null,null,null,"TOTAL PHOSPHORUS AVAILABLE FOR REMOVAL IN D.A. A (lb/yr)",{"$f":"$M$7","v":0}]
[null,null,null,null,null,null,null,"TOTAL PHOSPHORUS REMOVED WITH RUNOFF REDUCTION PRACTICES IN D.A. A (lb/yr)",{"$f":"IFERROR(SUM(L13:L55),0)","v":0},null,null,null,null,null,null,null,null,null,null,null,"TOTAL RUNOFF REDUCTION IN D.A. A (ft3)",{"$f":"F60","v":0}]
[null,null,null,null,null,null,null,"TOTAL PHOSPHORUS REMAINING AFTER APPLYING RUNOFF REDUCTION PRACTICES IN D.A. A (lb/yr)",{"$f":"I62-I63","v":0},null,null,null,null,null,null,null,null,null,null,null,"NITROGEN REMOVED WITH RUNOFF REDUCTION PRACTICES IN D.A. A (lb/yr)",{"$f":"SUM($T$13:$T$55)","v":0}]
[]
[null,null,"SEE WATER QUALITY COMPLIANCE TAB FOR SITE COMPLIANCE CALCULATIONS",null,null,null,null,null,null,null,null,null,null,null,null,null,null,null,null,null,null,"           SEE WATER QUALITY COMPLIANCE TAB FOR SITE CALCULATIONS (Information Only)"]
[]
[]
[]
[]
["10. Wet Swale (no RR)",null,null,null,null,null,null,null,null,null,null,null,null,null,null,null,null,"10. Wet Swale (Coastal Plain) (no RR)"]
["10.a. Wet Swale #1 (Spec #11)",0,null,null,{"$f":"SUMIF($N$13:$N$92,$P145,$G$13:$G$92)","v":0},{"$f":"(Site!$B$32*($G$6*$C72+$G$7*$D72)*3630+$E72)*$B72/100","v":0},{"$f":"(Site!$B$32*($G$6*$C72+$G$7*$D72)*3630+$E72)*(1-$B72/100)","v":0},{"$f":"+$F72+$G72","v":0},20,{"$f":"SUMIF($N$13:$N$92,$P145,$M$13:$M$92)","v":0},{"$f":"(Site!$B$32*($G$6*$C72+$G$7*$D72)*3630)*Site!$B$33*0.3048^3/454*Site!$B$31/Site!$B$32*Site!$B$36","v":0},{"$f":"IFERROR(($J72+$K72)*($F72+$G72*$I72/100)/$H72,0)","v":0},{"$f":"$J72+$K72-$L72","v":0},null,null,null,25,{"$f":"SUMIF($N$13:$N$92,$P145,$U$13:$U$92)","v":0},{"$f":"(Site!$B$32*($G$6*$C72+$G$7*$D72)*3630)*Site!$B$34*0.3048^3/454*Site!$B$31/Site!$B$32*Site!$B$36","v":0},{"$f":"IFERROR(($R72+$S72)*($F72+$G72*$Q72/100)/$H72,0)","v":0},{"$f":"$R72+$S72-$T72","v":0}]
["10.b. Wet Swale #2 (Spec #11)",0,null,null,{"$f":"SUMIF($N$13:$N$92,$P146,$G$13:$G$92)","v":0},{"$f":"(Site!$B$32*($G$6*$C73+$G$7*$D73)*3630+$E73)*$B73/100","v":0},{"$f":"(Site!$B$32*($G$6*$C73+$G$7*$D73)*3630+$E73)*(1-$B73/100)","v":0},0,40,{"$f":"SUMIF($N$13:$N$92,$P146,$M$13:$M$92)","v":0},{"$f":"(Site!$B$32*($G$6*$C73+$G$7*$D73)*3630)*Site!$B$33*0.3048^3/454*Site!$B$31/Site!$B$32*Site!$B$36","v":0},0,0,null,null,null,35,{"$f":"SUMIF($N$13:$N$92,$P146,$U$13:$U$92)","v":0},{"$f":"(Site!$B$32*($G$6*$C73+$G$7*$D73)*3630)*Site!$B$34*0.3048^3/454*Site!$B$31/Site!$B$32*Site!$B$36","v":0},0,0]
[]
["11.  Filtering Practices (no RR)",null,null,null,null,null,null,null,null,null,null,null,null,null,null,null,"11.  Filtering Practices (no RR)"]
["11.a.Filtering Practice #1 (Spec #12)",0,null,null,{"$f":"SUMIF($N$13:$N$92,$P147,$G$13:$G$92)","v":0},{"$f":"(Site!$B$32*($G$6*$C76+$G$7*$D76)*3630+$E76)*$B76/100","v":0},{"$f":"(Site!$B$32*($G$6*$C76+$G$7*$D76)*3630+$E76)*(1-$B76/100)","v":0},{"$f":"+$F76+$G76","v":0},60,{"$f":"SUMIF($N$13:$N$92,$P147,$M$13:$M$92)","v":0},{"$f":"(Site!$B$32*($G$6*$C76+$G$7*$D76)*3630)*Site!$B$33*0.3048^3/454*Site!$B$31/Site!$B$32*Site!$B$36","v":0},{"$f":"IFERROR(($J76+$K76)*($F76+$G76*$I76/100)/$H76,0)","v":0},{"$f":"$J76+$K76-$L76","v":0},null,null,null,30,{"$f":"SUMIF($N$13:$N$92,$P147,$U$13:$U$92)","v":0},{"$f":"(Site!$B$32*($G$6*$C76+$G$7*$D76)*3630)*Site!$B$34*0.3048^3/454*Site!$B$31/Site!$B$32*Site!$B$36","v":0},{"$f":"IFERROR(($R76+$S76)*($F76+$G76*$Q76/100)/$H76,0)","v":0},{"$f":"$R76+$S76-$T76","v":0}]
["11.b. Filtering Practice #2 (Spec #12)",0,null,null,{"$f":"SUMIF($N$13:$N$92,$P148,$G$13:$G$92)","v":0},{"$f":"(Site!$B$32*($G$6*$C77+$G$7*$D77)*3630+$E77)*$B77/100","v":0},{"$f":"(Site!$B$32*($G$6*$C77+$G$7*$D77)*3630+$E77)*(1-$B77/100)","v":0},0,65,{"$f":"SUMIF($N$13:$N$92,$P148,$M$13:$M$92)","v":0},{"$f":"(Site!$B$32*($G$6*$C77+$G$7*$D77)*3630)*Site!$B$33*0.3048^3/454*Site!$B$31/Site!$B$32*Site!$B$36","v":0},0,0,null,null,null,45,{"$f":"SUMIF($N$13:$N$92,$P148,$U$13:$U$92)","v":0},{"$f":"(Site!$B$32*($G$6*$C77+$G$7*$D77)*3630)*Site!$B$34*0.3048^3/454*Site!$B$31/Site!$B$32*Site!$B$36","v":0},0,0]
[]
["12. Constructed Wetland (no RR)",null,null,null,null,null,null,null,null,null,null,null,null,null,null,null,"12. Constructed Wetland (no RR)"]
["12.a.Constructed Wetland #1 (Spec #13)",0,null,null,{"$f":"SUMIF($N$13:$N$92,$P149,$G$13:$G$92)","v":0},{"$f":"(Site!$B$32*($G$6*$C80+$G$7*$D80)*3630+$E80)*$B80/100","v":0},{"$f":"(Site!$B$32*($G$6*$C80+$G$7*$D80)*3630+$E80)*(1-$B80/100)","v":0},{"$f":"+$F80+$G80","v":0},50,{"$f":"SUMIF($N$13:$N$92,$P149,$M$13:$M$92)","v":0},{"$f":"(Site!$B$32*($G$6*$C80+$G$7*$D80)*3630)*Site!$B$33*0.3048^3/454*Site!$B$31/Site!$B$32*Site!$B$36","v":0},{"$f":"IFERROR(($J80+$K80)*($F80+$G80*$I80/100)/$H80,0)","v":0},{"$f":"$J80+$K80-$L80","v":0},null,null,null,25,{"$f":"SUMIF($N$13:$N$92,$P149,$U$13:$U$92)","v":0},{"$f":"(Site!$B$32*($G$6*$C80+$G$7*$D80)*3630)*Site!$B$34*0.3048^3/454*Site!$B$31/Site!$B$32*Site!$B$36","v":0},{"$f":"IFERROR(($R80+$S80)*($F80+$G80*$Q80/100)/$H80,0)","v":0},{"$f":"$R80+$S80-$T80","v":0}]
["12.b. Constructed Wetland #2 (Spec #13)",0,null,null,{"$f":"SUMIF($N$13:$N$92,$P150,$G$13:$G$92)","v":0},{"$f":"(Site!$B$32*($G$6*$C81+$G$7*$D81)*3630+$E81)*$B81/100","v":0},{"$f":"(Site!$B$32*($G$6*$C81+$G$7*$D81)*3630+$E81)*(1-$B81/100)","v":0},0,75,{"$f":"SUMIF($N$13:$N$92,$P150,$M$13:$M$92)","v":0},{"$f":"(Site!$B$32*($G$6*$C81+$G$7*$D81)*3630)*Site!$B$33*0.3048^3/454*Site!$B$31/Site!$B$32*Site!$B$36","v":0},0,0,null,null,null,55,{"$f":"SUMIF($N$13:$N$92,$P150,$U$13:$U$92)","v":0},{"$f":"(Site!$B$32*($G$6*$C81+$G$7*$D81)*3630)*Site!$B$34*0.3048^3/454*Site!$B$31/Site!$B$32*Site!$B$36","v":0},0,0]
[]
["13. Wet Ponds (no RR)",null,null,null,null,null,null,null,null,null,null,null,null,null,null,null,"13. Wet Ponds (no RR)"]
["13.a. Wet Pond #1 (Spec #14)",0,null,null,{"$f":"SUMIF($N$13:$N$92,$P151,$G$13:$G$92)","v":0},{"$f":"(Site!$B$32*($G$6*$C84+$G$7*$D84)*3630+$E84)*$B84/100","v":0},{"$f":"(Site!$B$32*($G$6*$C84+$G$7*$D84)*3630+$E84)*(1-$B84/100)","v":0},{"$f":"+$F84+$G84","v":0},50,{"$f":"SUMIF($N$13:$N$92,$P151,$M$13:$M$92)","v":0},{"$f":"(Site!$B$32*($G$6*$C84+$G$7*$D84)*3630)*Site!$B$33*0.3048^3/454*Site!$B$31/Site!$B$32*Site!$B$36","v":0},{"$f":"IFERROR(($J84+$K84)*($F84+$G84*$I84/100)/$H84,0)","v":0},{"$f":"$J84+$K84-$L84","v":0},null,null,null,30,{"$f":"SUMIF($N$13:$N$92,$P151,$U$13:$U$92)","v":0},{"$f":"(Site!$B$32*($G$6*$C84+$G$7*$D84)*3630)*Site!$B$34*0.3048^3/454*Site!$B$31/Site!$B$32*Site!$B$36","v":0},{"$f":"IFERROR(($R84+$S84)*($F84+$G84*$Q84/100)/$H84,0)","v":0},{"$f":"$R84+$S84-$T84","v":0}]
["13.b. Wet Pond #1 (Coastal Plain) (Spec #14)",0,null,null,{"$f":"SUMIF($N$13:$N$92,$P152,$G$13:$G$92)","v":0},{"$f":"(Site!$B$32*($G$6*$C85+$G$7*$D85)*3630+$E85)*$B85/100","v":0},{"$f":"(Site!$B$32*($G$6*$C85+$G$7*$D85)*3630+$E85)*(1-$B85/100)","v":0},0,45,{"$f":"SUMIF($N$13:$N$92,$P152,$M$13:$M$92)","v":0},{"$f":"(Site!$B$32*($G$6*$C85+$G$7*$D85)*3630)*Site!$B$33*0.3048^3/454*Site!$B$31/Site!$B$32*Site!$B$36","v":0},0,0,null,null,null,20,{"$f":"SUMIF($N$13:$N$92,$P152,$U$13:$U$92)","v":0},{"$f":"(Site!$B$32*($G$6*$C85+$G$7*$D85)*3630)*Site!$B$34*0.3048^3/454*Site!$B$31/Site!$B$32*Site!$B$36","v":0},0,0]
["13.c. Wet Pond #2 (Spec #14)",0,null,null,0,{"$f":"(Site!$B$32*($G$6*$C86+$G$7*$D86)*3630+$E86)*$B86/100","v":0},{"$f":"(Site!$B$32*($G$6*$C86+$G$7*$D86)*3630+$E86)*(1-$B86/100)","v":0},0,75,0,{"$f":"(Site!$B$32*($G$6*$C86+$G$7*$D86)*3630)*Site!$B$33*0.3048^3/454*Site!$B$31/Site!$B$32*Site!$B$36","v":0},0,0,null,null,null,40,0,{"$f":"(Site!$B$32*($G$6*$C86+$G$7*$D86)*3630)*Site!$B$34*0.3048^3/454*Site!$B$31/Site!$B$32*Site!$B$36","v":0},0,0]
["13.d. Wet Pond #2 (Coastal Plain) (Spec #14)",0,null,null,0,{"$f":"(Site!$B$32*($G$6*$C87+$G$7*$D87)*3630+$E87)*$B87/100","v":0},{"$f":"(Site!$B$32*($G$6*$C87+$G$7*$D87)*3630+$E87)*(1-$B87/100)","v":0},0,65,0,{"$f":"(Site!$B$32*($G$6*$C87+$G$7*$D87)*3630)*Site!$B$33*0.3048^3/454*Site!$B$31/Site!$B$32*Site!$B$36","v":0},0,0,null,null,null,30,0,{"$f":"(Site!$B$32*($G$6*$C87+$G$7*$D87)*3630)*Site!$B$34*0.3048^3/454*Site!$B$31/Site!$B$32*Site!$B$36","v":0},0,0]
[]
["14. Manufactured Treatment Devices (no RR)",null,null,null,null,null,null,null,null,null,null,null,null,null,null,null,null,"14. Manufactured BMP (no RR)"]
["14.a. Manufactured Treatment Device-Hydrodynamic",0,null,null,{"$f":"SUMIF($N$13:$N$92,$P155,$G$13:$G$92)","v":0},{"$f":"(Site!$B$32*($G$6*$C90+$G$7*$D90)*3630+$E90)*$B90/100","v":0},{"$f":"(Site!$B$32*($G$6*$C90+$G$7*$D90)*3630+$E90)*(1-$B90/100)","v":0},{"$f":"+$F90+$G90","v":0},20,{"$f":"SUMIF($N$13:$N$92,$P155,$M$13:$M$92)","v":0},{"$f":"(Site!$B$32*($G$6*$C90+$G$7*$D90)*3630)*Site!$B$33*0.3048^3/454*Site!$B$31/Site!$B$32*Site!$B$36","v":0},{"$f":"IFERROR(($J90+$K90)*($F90+$G90*$I90/100)/$H90,0)","v":0},{"$f":"$J90+$K90-$L90","v":0},null,null,null,0,{"$f":"SUMIF($N$13:$N$92,$P155,$U$13:$U$92)","v":0},{"$f":"(Site!$B$32*($G$6*$C90+$G$7*$D90)*3630)*Site!$B$34*0.3048^3/454*Site!$B$31/Site!$B$32*Site!$B$36","v":0},{"$f":"IFERROR(($R90+$S90)*($F90+$G90*$Q90/100)/$H90,0)","v":0},{"$f":"$R90+$S90-$T90","v":0}]
["14.b. Manufactured Treatment Device-Filtering",0,null,null,{"$f":"SUMIF($N$13:$N$92,$P156,$G$13:$G$92)","v":0},{"$f":"(Site!$B$32*($G$6*$C91+$G$7*$D91)*3630+$E91)*$B91/100","v":0},{"$f":"(Site!$B$32*($G$6*$C91+$G$7*$D91)*3630+$E91)*(1-$B91/100)","v":0},0,20,{"$f":"SUMIF($N$13:$N$92,$P156,$M$13:$M$92)","v":0},{"$f":"(Site!$B$32*($G$6*$C91+$G$7*$D91)*3630)*Site!$B$33*0.3048^3/454*Site!$B$31/Site!$B$32*Site!$B$36","v":0},0,0,null,null,null,0,{"$f":"SUMIF($N$13:$N$92,$P156,$U$13:$U$92)","v":0},{"$f":"(Site!$B$32*($G$6*$C91+$G$7*$D91)*3630)*Site!$B$34*0.3048^3/454*Site!$B$31/Site!$B$32*Site!$B$36","v":0},0,0]
["14.c. Manufactured Treatment Device-Generic",0,null,null,0,{"$f":"(Site!$B$32*($G$6*$C92+$G$7*$D92)*3630+$E92)*$B92/100","v":0},{"$f":"(Site!$B$32*($G$6*$C92+$G$7*$D92)*3630+$E92)*(1-$B92/100)","v":0},0,20,0,{"$f":"(Site!$B$32*($G$6*$C92+$G$7*$D92)*3630)*Site!$B$33*0.3048^3/454*Site!$B$31/Site!$B$32*Site!$B$36","v":0},0,0,null,null,null,0,0,{"$f":"(Site!$B$32*($G$6*$C92+$G$7*$D92)*3630)*Site!$B$34*0.3048^3/454*Site!$B$31/Site!$B$32*Site!$B$36","v":0},0,0]
[]
[]
[]
[null,null,null,null,"TOTAL IMPERVIOUS COVER TREATED (ac)",{"$f":"SUM($D$13:$D$92)","v":0},"AREA CHECK:",{"$f":"IF($F$96>$F$7,\"AREA EXCEEDED!\",\"OK.\")","v":"OK."}]
[null,null,null,null,"TOTAL MANAGED TURF AREA TREATED (ac)",{"$f":"SUM($C$13:$C$92)","v":0},"AREA CHECK:",{"$f":"IF($F$97>$F$6,\"AREA EXCEEDED!\",\"OK.\")","v":"OK."}]
[]
[null,null,null,null,null,null,null,"TOTAL PHOSPHORUS REMOVAL REQUIRED ON SITE (lb/yr)",{"$f":"IF(Site!G63=\"Check Areas!\",\"ERROR - \",Site!G63)","v":"--"},{"$f":"IF(I99=\"ERROR - \",\"Site Data Tab\",\"\")","v":""}]
[]
[null,null,null,null,null,null,null,"TOTAL PHOSPHORUS AVAILABLE FOR REMOVAL IN D.A. A (lb/yr)",{"$f":"$M$7","v":0}]
[null,null,null,null,null,null,null,"TOTAL PHOSPHORUS REMOVED WITHOUT RUNOFF REDUCTION PRACTICES IN D.A. A (lb/yr)",{"$f":"SUM($L$72:$L$92)","v":0}]
[null,null,null,null,null,null,null,"TOTAL PHOSPHORUS REMOVED WITH RUNOFF REDUCTION PRACTICES IN D.A. A (lb/yr)",{"$f":"$I$63","v":0}]
[null,null,null,null,null,null,null,"TOTAL PHOSPHORUS LOAD REDUCTION ACHIEVED IN D.A. A (lb/yr)",{"$f":"$I$102+$I$103","v":0}]
[null,null,null,null,null,null,null,"TOTAL PHOSPHORUS REMAINING AFTER APPLYING BMP LOAD REDUCTIONS IN D.A. A (lb/yr)",{"$f":"$I$101-$I$104","v":0}]
[]
[null,null,"SEE WATER QUALITY COMPLIANCE TAB FOR SITE COMPLIANCE CALCULATIONS"]
[]
[null,null,null,null,null,null,null,"NITROGEN REMOVED WITH RUNOFF REDUCTION PRACTICES IN D.A. A (lb/yr)",{"$f":"IFERROR(SUM($T$13:$T$55),0)","v":0}]
[null,null,null,null,null,null,null,"NITROGEN REMOVED WITHOUT RUNOFF REDUCTION PRACTICES IN D.A. A (lb/yr)",{"$f":"SUM($T$72:$T$92)","v":0}]
[null,null,null,null,null,null,null,"TOTAL NITROGEN REMOVED IN D.A. A (lb/yr)",{"$f":"$I$109+$I$110","v":0}]
[]
[]
[]
[]
[null,null,"Downstream Practices - Dropdown selections for each applicable BMP"]
[]
["Options for 1. Green Roof",null,"Options for 2. Impervious Surface Disconnection",null,"Options for 3a. Pervious Parking, A/B Soils",null,"Options for 4a. Grass Channels, A/B Soils",null,null,"Options for 4b. Grass Channels, C/D Soils"]
[null,null,null,null,null,null,null,null,null,null,null,"Options for 4.c. Grass Channel Compost Amended Soils",null,null,null,"Master Downstream BMP Reference List"]
[{"$f":"P120","v":"None"},null,{"$f":"P120","v":"None"},null,{"$f":"P120","v":"None"},null,{"$f":"P120","v":"None"},null,null,{"$f":"P120","v":"None"},null,null,null,null,null,"None"]
["2.a. Simple Disconnection to A/B Soils",null,{"$f":"P131","v":"4.a. Grass Channel A/B Soils"},null,{"$f":"P131","v":"4.a. Grass Channel A/B Soils"},null,{"$f":"P132","v":"4.b. Grass Channel C/D Soils"},null,null,{"$f":"P131","v":"4.a. Grass Channel A/B Soils"},null,{"$f":"P120","v":"None"},null,null,null,"2.a. Simple Disconnection to A/B Soils"]
["2.b. Simple Disconnection to C/D Soils",null,"4.b. Grass Channel C/D Soils",null,"4.b. Grass Channel C/D Soils",null,"4.c. Grass Channel Compost Amended Soils",null,null,{"$f":"P133","v":"4.c. Grass Channel Compost Amended Soils"},null,{"$f":"P131","v":"4.a. Grass Channel A/B Soils"},null,null,null,"2.b. Simple Disconnection to C/D Soils"]
["2.c. To Soil Amended Filter Path",null,"4.c. Grass Channel Compost Amended Soils",null,"4.c. Grass Channel Compost Amended Soils",null,"5.a. Dry Swale #1",null,null,"5.a. Dry Swale #1",null,{"$f":"P132","v":"4.b. Grass Channel C/D Soils"},null,null,null,"2.c. To Soil Amended Filter Path"]
["2.d. To Dry Well/French Drain #1 (Micro-Infiltration #1)",null,"5.a. Dry Swale #1",null,"5.a. Dry Swale #1",null,"5.b. Dry Swale #2",null,null,"5.b. Dry Swale #2",null,{"$f":"P134","v":"5.a. Dry Swale #1"},null,null,null,"2.d. To Dry Well/French Drain #1 (Micro-Infiltration #1)"]
["2.e. To Dry Well/French Drain #2 (Micro-Infiltration. #2)",null,"5.b. Dry Swale #2",null,"5.b. Dry Swale #2",null,"6.a. Bioretention #1",null,null,"6.a. Bioretention #1",null,"5.b. Dry Swale #2",null,null,null,"2.e. To Dry Well/French Drain #2 (Micro-Infiltration. #2)"]
["2.f. To Rain Garden #1 (Micro-Bioretention #1)",null,"6.a. Bioretention #1",null,"6.a. Bioretention #1",null,"6.b. Bioretention #2",null,null,"6.b. Bioretention #2",null,"6.a. Bioretention #1",null,null,null,"2.f. To Rain Garden #1 (Micro-Bioretention #1)"]
["2.g. To Rain Garden #2 (Micro-Bioretention #2)",null,"6.b. Bioretention #2",null,"6.b. Bioretention #2",null,"7.a. Infiltration #1",null,null,"7.a. Infiltration #1",null,"6.b. Bioretention #2",null,null,null,"2.g. To Rain Garden #2 (Micro-Bioretention #2)"]
["2.h. To Train Barrel, Rain Tank, or Cistern",null,"7.a. Infiltration #1",null,"7.a. Infiltration #1",null,"7.b. Infiltration #2",null,null,"7.b. Infiltration #2",null,"7.a. Infiltration #1",null,null,null,"2.h. To Train Barrel, Rain Tank, or Cistern"]
["2.i. To Stormwater Planter (Urban Bioretention)",null,"7.b. Infiltration #2",null,"7.b. Infiltration #2",null,"8.a. ED #1",null,null,"8.a. ED #1",null,"7.b. Infiltration #2",null,null,null,"2.i. To Stormwater Planter (Urban Bioretention)"]
["3.a. Permeable Pavement #1",null,"8.a. ED #1",null,"8.a. ED #1",null,"8.b. ED #2",null,null,"8.b. ED #2",null,"8.a. ED #1",null,null,null,"3.a. Permeable Pavement #1"]
["4.a. Grass Channel A/B Soils",null,"8.b. ED #2",null,"8.b. ED #2",null,"9.a. Sheetflow to A/B Soil Conservation Area ",null,null,"9.a. Sheetflow to A/B Soil Conservation Area ",null,"8.b. ED #2",null,null,null,"4.a. Grass Channel A/B Soils"]
["4.b. Grass Channel C/D Soils",null,"9.a. Sheetflow to A/B Soil Conservation Area ",null,"9.a. Sheetflow to A/B Soil Conservation Area ",null,"9.b. Sheetflow to C/D Soil Conservation Area",null,null,"9.b. Sheetflow to C/D Soil Conservation Area",null,"9.a. Sheetflow to A/B Soil Conservation Area ",null,null,null,"4.b. Grass Channel C/D Soils"]
["4.c. Grass Channel Compost Amended Soils",null,"9.b. Sheetflow to C/D Soil Conservation Area",null,"9.b. Sheetflow to C/D Soil Conservation Area",null,"9.c. Sheetflow to Vegetated Filter Strip",null,null,"9.c. Sheetflow to Vegetated Filter Strip",null,"9.b. Sheetflow to C/D Soil Conservation Area",null,null,null,"4.c. Grass Channel Compost Amended Soils"]
["5.a. Dry Swale #1",null,"9.c. Sheetflow to Vegetated Filter Strip",null,"9.c. Sheetflow to Vegetated Filter Strip",null,"10.a. Wet Swale #1",null,null,"10.a. Wet Swale #1",null,"9.c. Sheetflow to Vegetated Filter Strip",null,null,null,"5.a. Dry Swale #1"]
["5.b. Dry Swale #2",null,"10.a. Wet Swale #1",null,"10.a. Wet Swale #1",null,"10.b. Wet Swale #2",null,null,"10.b. Wet Swale #2",null,"10.a. Wet Swale #1",null,null,null,"5.b. Dry Swale #2"]
["6.a. Bioretention #1",null,"10.b. Wet Swale #2",null,"10.b. Wet Swale #2",null,"11.a. Filtering Practice #1",null,null,"11.a. Filtering Practice #1",null,"10.b. Wet Swale #2",null,null,null,"6.a. Bioretention #1"]
["6.b. Bioretention #2",null,"11.a. Filtering Practice #1",null,"11.a. Filtering Practice #1",null,"11.b. Filtering Practice #2",null,null,"11.b. Filtering Practice #2",null,"11.a. Filtering Practice #1",null,null,null,"6.b. Bioretention #2"]
["7.a. Infiltration #1",null,"11.b. Filtering Practice #2",null,"11.b. Filtering Practice #2",null,"12.a. Constructed Wetland #1",null,null,"12.a. Constructed Wetland #1",null,"11.b. Filtering Practice #2",null,null,null,"7.a. Infiltration #1"]
["7.b. Infiltration #2",null,"12.a. Constructed Wetland #1",null,"12.a. Constructed Wetland #1",null,"12.b. Constructed Wetland #2",null,null,"12.b. Constructed Wetland #2",null,"12.a. Constructed Wetland #1",null,null,null,"7.b. Infiltration #2"]
["8.a. ED #1",null,"12.b. Constructed Wetland #2",null,"12.b. Constructed Wetland #2",null,"13.a. Wet Pond #1",null,null,"13.a. Wet Pond #1",null,"12.b. Constructed Wetland #2",null,null,null,"8.a. ED #1"]
["8.b. ED #2",null,"13.a. Wet Pond #1",null,"13.a. Wet Pond #1",null,"13.b. Wet Pond #1 (Coastal Plain)",null,null,"13.b. Wet Pond #1 (Coastal Plain)",null,"13.a. Wet Pond #1",null,null,null,"8.b. ED #2"]
["9.a. Sheetflow to A/B Soil Conservation Area ",null,"13.b. Wet Pond #1 (Coastal Plain)",null,"13.b. Wet Pond #1 (Coastal Plain)",null,"13.c. Wet Pond #2",null,null,"13.c. Wet Pond #2",null,"13.b. Wet Pond #1 (Coastal Plain)",null,null,null,"9.a. Sheetflow to A/B Soil Conservation Area "]
["9.b. Sheetflow to C/D Soil Conservation Area",null,"13.c. Wet Pond #2",null,"13.c. Wet Pond #2",null,"13.d. Wet Pond #2 (Coastal Plain)",null,null,"13.d. Wet Pond #2 (Coastal Plain)",null,"13.c. Wet Pond #2",null,null,null,"9.b. Sheetflow to C/D Soil Conservation Area"]
["9.c. Sheetflow to Vegetated Filter Strip",null,"13.d. Wet Pond #2 (Coastal Plain)",null,"13.d. Wet Pond #2 (Coastal Plain)",null,"14.a. MTD - Hydrodynamic",null,null,"14.a. MTD - Hydrodynamic",null,"13.d. Wet Pond #2 (Coastal Plain)",null,null,null,"9.c. Sheetflow to Vegetated Filter Strip"]
["10.a. Wet Swale #1",null,"14.a. MTD - Hydrodynamic",null,"14.a. MTD - Hydrodynamic",null,"14.b. MTD - Filtering",null,null,"14.b. MTD - Filtering",null,"14.a. MTD - Hydrodynamic",null,null,null,"10.a. Wet Swale #1"]
["10.b. Wet Swale #2",null,"14.b. MTD - Filtering",null,"14.b. MTD - Filtering",null,"14.c. MTD - Generic",null,null,"14.c. MTD - Generic",null,"14.b. MTD - Filtering",null,null,null,"10.b. Wet Swale #2"]
["11.a. Filtering Practice #1",null,"14.c. MTD - Generic",null,"14.c. MTD - Generic",null,null,null,null,null,null,"14.c. MTD - Generic",null,null,null,"11.a. Filtering Practice #1"]
["11.b. Filtering Practice #2",null,null,null,null,null,null,null,null,null,null,null,null,null,null,"11.b. Filtering Practice #2"]
["12.a. Constructed Wetland #1",null,null,null,null,null,null,null,null,null,null,null,null,null,null,"12.a. Constructed Wetland #1"]
["12.b. Constructed Wetland #2",null,null,null,null,null,null,null,null,null,null,null,null,null,null,"12.b. Constructed Wetland #2"]
["13.a. Wet Pond #1",null,null,null,null,null,null,null,null,null,null,null,null,null,null,"13.a. Wet Pond #1"]
["13.b. Wet Pond #1 (Coastal Plain)",null,null,null,null,null,null,null,null,null,null,null,null,null,null,"13.b. Wet Pond #1 (Coastal Plain)"]
["13.c. Wet Pond #2",null,null,null,null,null,null,null,null,null,null,null,null,null,null,"13.c. Wet Pond #2"]
["13.d. Wet Pond #2 (Coastal Plain)",null,null,null,null,null,null,null,null,null,null,null,null,null,null,"13.d. Wet Pond #2 (Coastal Plain)"]
["14.a. MTD - Hydrodynamic",null,null,null,null,null,null,null,null,null,null,null,null,null,null,"14.a. MTD - Hydrodynamic"]
["14.b. MTD - Filtering",null,null,null,null,null,null,null,null,null,null,null,null,null,null,"14.b. MTD - Filtering"]
["14.c. MTD - Generic",null,null,null,null,null,null,null,null,null,null,null,null,null,null,"14.c. MTD - Generic"]
[]
["Options for 5a. Dry Swale #1",null,"Options for 5b. Dry Swale #2",null,"Options for 6a. Bioretention #1",null,"Options for 6b. Bioretention #2",null,null,"Options for 7a. Infiltration #1",null,"Options for 7b. Infiltration #2"]
[]
[{"$f":"P120","v":"None"},null,{"$f":"P120","v":"None"},null,{"$f":"P120","v":"None"},null,{"$f":"P120","v":"None"},null,null,{"$f":"P120","v":"None"},null,{"$f":"P120","v":"None"}]
[{"$f":"P131","v":"4.a. Grass Channel A/B Soils"},null,{"$f":"P131","v":"4.a. Grass Channel A/B Soils"},null,{"$f":"P131","v":"4.a. Grass Channel A/B Soils"},null,{"$f":"P131","v":"4.a. Grass Channel A/B Soils"},null,null,{"$f":"P131","v":"4.a. Grass Channel A/B Soils"},null,{"$f":"P131","v":"4.a. Grass Channel A/B Soils"}]
[{"$f":"P132","v":"4.b. Grass Channel C/D Soils"},null,{"$f":"P132","v":"4.b. Grass Channel C/D Soils"},null,{"$f":"P132","v":"4.b. Grass Channel C/D Soils"},null,"4.b. Grass Channel C/D Soils",null,null,"4.b. Grass Channel C/D Soils",null,"4.b. Grass Channel C/D Soils"]
[{"$f":"P133","v":"4.c. Grass Channel Compost Amended Soils"},null,{"$f":"P133","v":"4.c. Grass Channel Compost Amended Soils"},null,{"$f":"P133","v":"4.c. Grass Channel Compost Amended Soils"},null,"4.c. Grass Channel Compost Amended Soils",null,null,"4.c. Grass Channel Compost Amended Soils",null,"4.c. Grass Channel Compost Amended Soils"]
[{"$f":"P135","v":"5.b. Dry Swale #2"},null,{"$f":"P134","v":"5.a. Dry Swale #1"},null,{"$f":"P134","v":"5.a. Dry Swale #1"},null,"5.a. Dry Swale #1",null,null,"5.a. Dry Swale #1",null,"5.a. Dry Swale #1"]
["6.a. Bioretention #1",null,{"$f":"P136","v":"6.a. Bioretention #1"},null,{"$f":"P135","v":"5.b. Dry Swale #2"},null,"5.b. Dry Swale #2",null,null,"5.b. Dry Swale #2",null,"5.b. Dry Swale #2"]
["6.b. Bioretention #2",null,"6.b. Bioretention #2",null,{"$f":"P137","v":"6.b. Bioretention #2"},null,"6.a. Bioretention #1",null,null,"6.a. Bioretention #1",null,"6.a. Bioretention #1"]
["7.a. Infiltration #1",null,"7.a. Infiltration #1",null,"7.a. Infiltration #1",null,{"$f":"P138","v":"7.a. Infiltration #1"},null,null,"6.b. Bioretention #2",null,"6.b. Bioretention #2"]
["7.b. Infiltration #2",null,"7.b. Infiltration #2",null,"7.b. Infiltration #2",null,"7.b. Infiltration #2",null,null,{"$f":"P139","v":"7.b. Infiltration #2"},null,"7.a. Infiltration #1"]
["8.a. ED #1",null,"8.a. ED #1",null,"8.a. ED #1",null,"8.a. ED #1",null,null,"8.a. ED #1",null,{"$f":"P140","v":"8.a. ED #1"}]
["8.b. ED #2",null,"8.b. ED #2",null,"8.b. ED #2",null,"8.b. ED #2",null,null,"8.b. ED #2",null,"8.b. ED #2"]
["9.a. Sheetflow to A/B Soil Conservation Area ",null,"9.a. Sheetflow to A/B Soil Conservation Area ",null,"9.a. Sheetflow to A/B Soil Conservation Area ",null,"9.a. Sheetflow to A/B Soil Conservation Area ",null,null,"9.a. Sheetflow to A/B Soil Conservation Area ",null,"9.a. Sheetflow to A/B Soil Conservation Area "]
["9.b. Sheetflow to C/D Soil Conservation Area",null,"9.b. Sheetflow to C/D Soil Conservation Area",null,"9.b. Sheetflow to C/D Soil Conservation Area",null,"9.b. Sheetflow to C/D Soil Conservation Area",null,null,"9.b. Sheetflow to C/D Soil Conservation Area",null,"9.b. Sheetflow to C/D Soil Conservation Area"]
["9.c. Sheetflow to Vegetated Filter Strip",null,"9.c. Sheetflow to Vegetated Filter Strip",null,"9.c. Sheetflow to Vegetated Filter Strip",null,"9.c. Sheetflow to Vegetated Filter Strip",null,null,"9.c. Sheetflow to Vegetated Filter Strip",null,"9.c. Sheetflow to Vegetated Filter Strip"]
["10.a. Wet Swale #1",null,"10.a. Wet Swale #1",null,"10.a. Wet Swale #1",null,"10.a. Wet Swale #1",null,null,"10.a. Wet Swale #1",null,"10.a. Wet Swale #1"]
["10.b. Wet Swale #2",null,"10.b. Wet Swale #2",null,"10.b. Wet Swale #2",null,"10.b. Wet Swale #2",null,null,"10.b. Wet Swale #2",null,"10.b. Wet Swale #2"]
["11.a. Filtering Practice #1",null,"11.a. Filtering Practice #1",null,"11.a. Filtering Practice #1",null,"11.a. Filtering Practice #1",null,null,"11.a. Filtering Practice #1",null,"11.a. Filtering Practice #1"]
["11.b. Filtering Practice #2",null,"11.b. Filtering Practice #2",null,"11.b. Filtering Practice #2",null,"11.b. Filtering Practice #2",null,null,"11.b. Filtering Practice #2",null,"11.b. Filtering Practice #2"]
["12.a. Constructed Wetland #1",null,"12.a. Constructed Wetland #1",null,"12.a. Constructed Wetland #1",null,"12.a. Constructed Wetland #1",null,null,"12.a. Constructed Wetland #1",null,"12.a. Constructed Wetland #1"]
["12.b. Constructed Wetland #2",null,"12.b. Constructed Wetland #2",null,"12.b. Constructed Wetland #2",null,"12.b. Constructed Wetland #2",null,null,"12.b. Constructed Wetland #2",null,"12.b. Constructed Wetland #2"]
["13.a. Wet Pond #1",null,"13.a. Wet Pond #1",null,"13.a. Wet Pond #1",null,"13.a. Wet Pond #1",null,null,"13.a. Wet Pond #1",null,"13.a. Wet Pond #1"]
["13.b. Wet Pond #1 (Coastal Plain)",null,"13.b. Wet Pond #1 (Coastal Plain)",null,"13.b. Wet Pond #1 (Coastal Plain)",null,"13.b. Wet Pond #1 (Coastal Plain)",null,null,"13.b. Wet Pond #1 (Coastal Plain)",null,"13.b. Wet Pond #1 (Coastal Plain)"]
["13.c. Wet Pond #2",null,"13.c. Wet Pond #2",null,"13.c. Wet Pond #2",null,"13.c. Wet Pond #2",null,null,"13.c. Wet Pond #2",null,"13.c. Wet Pond #2"]
["13.d. Wet Pond #2 (Coastal Plain)",null,"13.d. Wet Pond #2 (Coastal Plain)",null,"13.d. Wet Pond #2 (Coastal Plain)",null,"13.d. Wet Pond #2 (Coastal Plain)",null,null,"13.d. Wet Pond #2 (Coastal Plain)",null,"13.d. Wet Pond #2 (Coastal Plain)"]
["14.a. MTD - Hydrodynamic",null,"14.a. MTD - Hydrodynamic",null,"14.a. MTD - Hydrodynamic",null,"14.a. MTD - Hydrodynamic",null,null,"14.a. MTD - Hydrodynamic",null,"14.a. MTD - Hydrodynamic"]
["14.b. MTD - Filtering",null,"14.b. MTD - Filtering",null,"14.b. MTD - Filtering",null,"14.b. MTD - Filtering",null,null,"14.b. MTD - Filtering",null,"14.b. MTD - Filtering"]
["14.c. MTD - Generic",null,"14.c. MTD - Generic",null,"14.c. MTD - Generic",null,"14.c. MTD - Generic",null,null,"14.c. MTD - Generic",null,"14.c. MTD - Generic"]
[]
["Options for 8a. Extended Detention #1",null,"Options for 8b. Extended Detention #2",null,"Options for 9 Sheet Flow to Open Space",null,"Options for 9c. Sheet Flow to Filter Strip",null,null,"Options for 10a. Wet Swale #1",null,"Options for 10b. Wet Swale #2"]
[]
[{"$f":"P120","v":"None"},null,{"$f":"P120","v":"None"},null,{"$f":"P120","v":"None"},null,{"$f":"P120","v":"None"},null,null,{"$f":"P120","v":"None"},null,{"$f":"P120","v":"None"}]
[{"$f":"P131","v":"4.a. Grass Channel A/B Soils"},null,{"$f":"P131","v":"4.a. Grass Channel A/B Soils"},null,null,null,{"$f":"P131","v":"4.a. Grass Channel A/B Soils"},null,null,{"$f":"P131","v":"4.a. Grass Channel A/B Soils"},null,{"$f":"P131","v":"4.a. Grass Channel A/B Soils"}]
["4.b. Grass Channel C/D Soils",null,"4.b. Grass Channel C/D Soils",null,null,null,"4.b. Grass Channel C/D Soils",null,null,"4.b. Grass Channel C/D Soils",null,"4.b. Grass Channel C/D Soils"]
["4.c. Grass Channel Compost Amended Soils",null,"4.c. Grass Channel Compost Amended Soils",null,null,null,"4.c. Grass Channel Compost Amended Soils",null,null,"4.c. Grass Channel Compost Amended Soils",null,"4.c. Grass Channel Compost Amended Soils"]
["5.a. Dry Swale #1",null,"5.a. Dry Swale #1",null,null,null,"5.a. Dry Swale #1",null,null,"5.a. Dry Swale #1",null,"5.a. Dry Swale #1"]
["5.b. Dry Swale #2",null,"5.b. Dry Swale #2",null,null,null,"5.b. Dry Swale #2",null,null,"5.b. Dry Swale #2",null,"5.b. Dry Swale #2"]
["6.a. Bioretention #1",null,"6.a. Bioretention #1",null,null,null,"6.a. Bioretention #1",null,null,"6.a. Bioretention #1",null,"6.a. Bioretention #1"]
["6.b. Bioretention #2",null,"6.b. Bioretention #2",null,null,null,"6.b. Bioretention #2",null,null,"6.b. Bioretention #2",null,"6.b. Bioretention #2"]
["7.a. Infiltration #1",null,"7.a. Infiltration #1",null,null,null,"7.a. Infiltration #1",null,null,"7.a. Infiltration #1",null,"7.a. Infiltration #1"]
["7.b. Infiltration #2",null,"7.b. Infiltration #2",null,null,null,"7.b. Infiltration #2",null,null,"7.b. Infiltration #2",null,"7.b. Infiltration #2"]
[{"$f":"P141","v":"8.b. ED #2"},null,"8.a. ED #1",null,null,null,"8.a. ED #1",null,null,"8.a. ED #1",null,"8.a. ED #1"]
["9.a. Sheetflow to A/B Soil Conservation Area ",null,{"$f":"P142","v":"9.a. Sheetflow to A/B Soil Conservation Area "},null,null,null,"8.b. ED #2",null,null,"8.b. ED #2",null,"8.b. ED #2"]
["9.b. Sheetflow to C/D Soil Conservation Area",null,"9.b. Sheetflow to C/D Soil Conservation Area",null,null,null,"9.a. Sheetflow to A/B Soil Conservation Area ",null,null,"9.a. Sheetflow to A/B Soil Conservation Area ",null,"9.a. Sheetflow to A/B Soil Conservation Area "]
["9.c. Sheetflow to Vegetated Filter Strip",null,"9.c. Sheetflow to Vegetated Filter Strip",null,null,null,"9.b. Sheetflow to C/D Soil Conservation Area",null,null,"9.b. Sheetflow to C/D Soil Conservation Area",null,"9.b. Sheetflow to C/D Soil Conservation Area"]
["10.a. Wet Swale #1",null,"10.a. Wet Swale #1",null,null,null,{"$f":"P145","v":"10.a. Wet Swale #1"},null,null,"9.c. Sheetflow to Vegetated Filter Strip",null,"9.c. Sheetflow to Vegetated Filter Strip"]
["10.b. Wet Swale #2",null,"10.b. Wet Swale #2",null,null,null,"10.b. Wet Swale #2",null,null,{"$f":"P146","v":"10.b. Wet Swale #2"},null,"10.a. Wet Swale #1"]
["11.a. Filtering Practice #1",null,"11.a. Filtering Practice #1",null,null,null,"11.a. Filtering Practice #1",null,null,"11.a. Filtering Practice #1",null,{"$f":"P147","v":"11.a. Filtering Practice #1"}]
["11.b. Filtering Practice #2",null,"11.b. Filtering Practice #2",null,null,null,"11.b. Filtering Practice #2",null,null,"11.b. Filtering Practice #2",null,"11.b. Filtering Practice #2"]
["12.a. Constructed Wetland #1",null,"12.a. Constructed Wetland #1",null,null,null,"12.a. Constructed Wetland #1",null,null,"12.a. Constructed Wetland #1",null,"12.a. Constructed Wetland #1"]
["12.b. Constructed Wetland #2",null,"12.b. Constructed Wetland #2",null,null,null,"12.b. Constructed Wetland #2",null,null,"12.b. Constructed Wetland #2",null,"12.b. Constructed Wetland #2"]
["13.a. Wet Pond #1",null,"13.a. Wet Pond #1",null,null,null,"13.a. Wet Pond #1",null,null,"13.a. Wet Pond #1",null,"13.a. Wet Pond #1"]
["13.b. Wet Pond #1 (Coastal Plain)",null,"13.b. Wet Pond #1 (Coastal Plain)",null,null,null,"13.b. Wet Pond #1 (Coastal Plain)",null,null,"13.b. Wet Pond #1 (Coastal Plain)",null,"13.b. Wet Pond #1 (Coastal Plain)"]
["13.c. Wet Pond #2",null,"13.c. Wet Pond #2",null,null,null,"13.c. Wet Pond #2",null,null,"13.c. Wet Pond #2",null,"13.c. Wet Pond #2"]
["13.d. Wet Pond #2 (Coastal Plain)",null,"13.d. Wet Pond #2 (Coastal Plain)",null,null,null,"13.d. Wet Pond #2 (Coastal Plain)",null,null,"13.d. Wet Pond #2 (Coastal Plain)",null,"13.d. Wet Pond #2 (Coastal Plain)"]
["14.a. MTD - Hydrodynamic",null,"14.a. MTD - Hydrodynamic",null,null,null,"14.a. MTD - Hydrodynamic",null,null,"14.a. MTD - Hydrodynamic",null,"14.a. MTD - Hydrodynamic"]
["14.b. MTD - Filtering",null,"14.b. MTD - Filtering",null,null,null,"14.b. MTD - Filtering",null,null,"14.b. MTD - Filtering",null,"14.b. MTD - Filtering"]
["14.c. MTD - Generic",null,"14.c. MTD - Generic",null,null,null,"14.c. MTD - Generic",null,null,"14.c. MTD - Generic",null,"14.c. MTD - Generic"]
[]
[null,null,null,null,"Options for 12.a.  Constructed Wetland #1",null,"Options for 12.b.  Constructed Wetland #2"]
["Options for 11 A.  Filtering Practice #1",null,"Options for 11 b.  Filtering Practice #2",null,null,null,null,null,null,"Options for 13.a.  Wet Pond #1"]
[{"$f":"P120","v":"None"},null,{"$f":"P120","v":"None"},null,{"$f":"P120","v":"None"},null,{"$f":"P120","v":"None"},null,null,{"$f":"P120","v":"None"},null,"Options for 13.b.  Wet Pond #1 (Coastal Plain)"]
[{"$f":"P131","v":"4.a. Grass Channel A/B Soils"},null,{"$f":"P131","v":"4.a. Grass Channel A/B Soils"},null,{"$f":"P131","v":"4.a. Grass Channel A/B Soils"},null,{"$f":"P131","v":"4.a. Grass Channel A/B Soils"},null,null,{"$f":"P131","v":"4.a. Grass Channel A/B Soils"},null,{"$f":"P120","v":"None"}]
["4.b. Grass Channel C/D Soils",null,"4.b. Grass Channel C/D Soils",null,"4.b. Grass Channel C/D Soils",null,"4.b. Grass Channel C/D Soils",null,null,"4.b. Grass Channel C/D Soils",null,{"$f":"P131","v":"4.a. Grass Channel A/B Soils"}]
["4.c. Grass Channel Compost Amended Soils",null,"4.c. Grass Channel Compost Amended Soils",null,"4.c. Grass Channel Compost Amended Soils",null,"4.c. Grass Channel Compost Amended Soils",null,null,"4.c. Grass Channel Compost Amended Soils",null,"4.b. Grass Channel C/D Soils"]
["5.a. Dry Swale #1",null,"5.a. Dry Swale #1",null,"5.a. Dry Swale #1",null,"5.a. Dry Swale #1",null,null,"5.a. Dry Swale #1",null,"4.c. Grass Channel Compost Amended Soils"]
["5.b. Dry Swale #2",null,"5.b. Dry Swale #2",null,"5.b. Dry Swale #2",null,"5.b. Dry Swale #2",null,null,"5.b. Dry Swale #2",null,"5.a. Dry Swale #1"]
["6.a. Bioretention #1",null,"6.a. Bioretention #1",null,"6.a. Bioretention #1",null,"6.a. Bioretention #1",null,null,"6.a. Bioretention #1",null,"5.b. Dry Swale #2"]
["6.b. Bioretention #2",null,"6.b. Bioretention #2",null,"6.b. Bioretention #2",null,"6.b. Bioretention #2",null,null,"6.b. Bioretention #2",null,"6.a. Bioretention #1"]
["7.a. Infiltration #1",null,"7.a. Infiltration #1",null,"7.a. Infiltration #1",null,"7.a. Infiltration #1",null,null,"7.a. Infiltration #1",null,"6.b. Bioretention #2"]
["7.b. Infiltration #2",null,"7.b. Infiltration #2",null,"7.b. Infiltration #2",null,"7.b. Infiltration #2",null,null,"7.b. Infiltration #2",null,"7.a. Infiltration #1"]
["8.a. ED #1",null,"8.a. ED #1",null,"8.a. ED #1",null,"8.a. ED #1",null,null,"8.a. ED #1",null,"7.b. Infiltration #2"]
["8.b. ED #2",null,"8.b. ED #2",null,"8.b. ED #2",null,"8.b. ED #2",null,null,"8.b. ED #2",null,"8.a. ED #1"]
["9.a. Sheetflow to A/B Soil Conservation Area ",null,"9.a. Sheetflow to A/B Soil Conservation Area ",null,"9.a. Sheetflow to A/B Soil Conservation Area ",null,"9.a. Sheetflow to A/B Soil Conservation Area ",null,null,"9.a. Sheetflow to A/B Soil Conservation Area ",null,"8.b. ED #2"]
["9.b. Sheetflow to C/D Soil Conservation Area",null,"9.b. Sheetflow to C/D Soil Conservation Area",null,"9.b. Sheetflow to C/D Soil Conservation Area",null,"9.b. Sheetflow to C/D Soil Conservation Area",null,null,"9.b. Sheetflow to C/D Soil Conservation Area",null,"9.a. Sheetflow to A/B Soil Conservation Area "]
["9.c. Sheetflow to Vegetated Filter Strip",null,"9.c. Sheetflow to Vegetated Filter Strip",null,"9.c. Sheetflow to Vegetated Filter Strip",null,"9.c. Sheetflow to Vegetated Filter Strip",null,null,"9.c. Sheetflow to Vegetated Filter Strip",null,"9.b. Sheetflow to C/D Soil Conservation Area"]
["10.a. Wet Swale #1",null,"10.a. Wet Swale #1",null,"10.a. Wet Swale #1",null,"10.a. Wet Swale #1",null,null,"10.a. Wet Swale #1",null,"9.c. Sheetflow to Vegetated Filter Strip"]
["10.b. Wet Swale #2",null,"10.b. Wet Swale #2",null,"10.b. Wet Swale #2",null,"10.b. Wet Swale #2",null,null,"10.b. Wet Swale #2",null,"10.a. Wet Swale #1"]
[{"$f":"P148","v":"11.b. Filtering Practice #2"},null,"11.a. Filtering Practice #1",null,"11.a. Filtering Practice #1",null,"11.a. Filtering Practice #1",null,null,"11.a. Filtering Practice #1",null,"10.b. Wet Swale #2"]
["12.a. Constructed Wetland #1",null,{"$f":"P149","v":"12.a. Constructed Wetland #1"},null,"11.b. Filtering Practice #2",null,"11.b. Filtering Practice #2",null,null,"11.b. Filtering Practice #2",null,"11.a. Filtering Practice #1"]
["12.b. Constructed Wetland #2",null,"12.b. Constructed Wetland #2",null,{"$f":"P150","v":"12.b. Constructed Wetland #2"},null,"12.a. Constructed Wetland #1",null,null,"12.a. Constructed Wetland #1",null,"11.b. Filtering Practice #2"]
["13.a. Wet Pond #1",null,"13.a. Wet Pond #1",null,"13.a. Wet Pond #1",null,{"$f":"P151","v":"13.a. Wet Pond #1"},null,null,"12.b. Constructed Wetland #2",null,"12.a. Constructed Wetland #1"]
["13.b. Wet Pond #1 (Coastal Plain)",null,"13.b. Wet Pond #1 (Coastal Plain)",null,"13.b. Wet Pond #1 (Coastal Plain)",null,"13.b. Wet Pond #1 (Coastal Plain)",null,null,{"$f":"P153","v":"13.c. Wet Pond #2"},null,"12.b. Constructed Wetland #2"]
["13.c. Wet Pond #2",null,"13.c. Wet Pond #2",null,"13.c. Wet Pond #2",null,"13.c. Wet Pond #2",null,null,{"$f":"P155","v":"14.a. MTD - Hydrodynamic"},null,{"$f":"P154","v":"13.d. Wet Pond #2 (Coastal Plain)"}]
["13.d. Wet Pond #2 (Coastal Plain)",null,"13.d. Wet Pond #2 (Coastal Plain)",null,"13.d. Wet Pond #2 (Coastal Plain)",null,"13.d. Wet Pond #2 (Coastal Plain)",null,null,{"$f":"P156","v":"14.b. MTD - Filtering"},null,{"$f":"P155","v":"14.a. MTD - Hydrodynamic"}]
["14.a. MTD - Hydrodynamic",null,"14.a. MTD - Hydrodynamic",null,"14.a. MTD - Hydrodynamic",null,"14.a. MTD - Hydrodynamic",null,null,{"$f":"P157","v":"14.c. MTD - Generic"},null,{"$f":"P156","v":"14.b. MTD - Filtering"}]
["14.b. MTD - Filtering",null,"14.b. MTD - Filtering",null,"14.b. MTD - Filtering",null,"14.b. MTD - Filtering",null,null,null,null,{"$f":"P157","v":"14.c. MTD - Generic"}]
["14.c. MTD - Generic",null,"14.c. MTD - Generic",null,"14.c. MTD - Generic",null,"14.c. MTD - Generic"]
[]
[]
[]
["Options for 13.c.  Wet Pond #2",null,"Options for 13.d.  Wet Pond #2 (Coastal Plain)",null,"Options for 14.a.  Manufactured Device-Hydrodynamic",null,"Options for 14.b.  Manufactured Device-Filtering",null,null,null,"Options for 14.c.  Manufactured Device-Generic"]
[]
[{"$f":"P120","v":"None"},null,{"$f":"P120","v":"None"},null,{"$f":"P120","v":"None"},null,{"$f":"P120","v":"None"},null,null,null,{"$f":"P120","v":"None"}]
[{"$f":"P131","v":"4.a. Grass Channel A/B Soils"},null,{"$f":"P131","v":"4.a. Grass Channel A/B Soils"},null,{"$f":"P131","v":"4.a. Grass Channel A/B Soils"},null,{"$f":"P131","v":"4.a. Grass Channel A/B Soils"},null,null,null,{"$f":"P131","v":"4.a. Grass Channel A/B Soils"}]
["4.b. Grass Channel C/D Soils",null,"4.b. Grass Channel C/D Soils",null,"4.b. Grass Channel C/D Soils",null,"4.b. Grass Channel C/D Soils",null,null,null,"4.b. Grass Channel C/D Soils"]
["4.c. Grass Channel Compost Amended Soils",null,"4.c. Grass Channel Compost Amended Soils",null,"4.c. Grass Channel Compost Amended Soils",null,"4.c. Grass Channel Compost Amended Soils",null,null,null,"4.c. Grass Channel Compost Amended Soils"]
["5.a. Dry Swale #1",null,"5.a. Dry Swale #1",null,"5.a. Dry Swale #1",null,"5.a. Dry Swale #1",null,null,null,"5.a. Dry Swale #1"]
["5.b. Dry Swale #2",null,"5.b. Dry Swale #2",null,"5.b. Dry Swale #2",null,"5.b. Dry Swale #2",null,null,null,"5.b. Dry Swale #2"]
["6.a. Bioretention #1",null,"6.a. Bioretention #1",null,"6.a. Bioretention #1",null,"6.a. Bioretention #1",null,null,null,"6.a. Bioretention #1"]
["6.b. Bioretention #2",null,"6.b. Bioretention #2",null,"6.b. Bioretention #2",null,"6.b. Bioretention #2",null,null,null,"6.b. Bioretention #2"]
["7.a. Infiltration #1",null,"7.a. Infiltration #1",null,"7.a. Infiltration #1",null,"7.a. Infiltration #1",null,null,null,"7.a. Infiltration #1"]
["7.b. Infiltration #2",null,"7.b. Infiltration #2",null,"7.b. Infiltration #2",null,"7.b. Infiltration #2",null,null,null,"7.b. Infiltration #2"]
["8.a. ED #1",null,"8.a. ED #1",null,"8.a. ED #1",null,"8.a. ED #1",null,null,null,"8.a. ED #1"]
["8.b. ED #2",null,"8.b. ED #2",null,"8.b. ED #2",null,"8.b. ED #2",null,null,null,"8.b. ED #2"]
["9.a. Sheetflow to A/B Soil Conservation Area ",null,"9.a. Sheetflow to A/B Soil Conservation Area ",null,"9.a. Sheetflow to A/B Soil Conservation Area ",null,"9.a. Sheetflow to A/B Soil Conservation Area ",null,null,null,"9.a. Sheetflow to A/B Soil Conservation Area "]
["9.b. Sheetflow to C/D Soil Conservation Area",null,"9.b. Sheetflow to C/D Soil Conservation Area",null,"9.b. Sheetflow to C/D Soil Conservation Area",null,"9.b. Sheetflow to C/D Soil Conservation Area",null,null,null,"9.b. Sheetflow to C/D Soil Conservation Area"]
["9.c. Sheetflow to Vegetated Filter Strip",null,"9.c. Sheetflow to Vegetated Filter Strip",null,"9.c. Sheetflow to Vegetated Filter Strip",null,"9.c. Sheetflow to Vegetated Filter Strip",null,null,null,"9.c. Sheetflow to Vegetated Filter Strip"]
["10.a. Wet Swale #1",null,"10.a. Wet Swale #1",null,"10.a. Wet Swale #1",null,"10.a. Wet Swale #1",null,null,null,"10.a. Wet Swale #1"]
["10.b. Wet Swale #2",null,"10.b. Wet Swale #2",null,"10.b. Wet Swale #2",null,"10.b. Wet Swale #2",null,null,null,"10.b. Wet Swale #2"]
["11.a. Filtering Practice #1",null,"11.a. Filtering Practice #1",null,"11.a. Filtering Practice #1",null,"11.a. Filtering Practice #1",null,null,null,"11.a. Filtering Practice #1"]
["11.b. Filtering Practice #2",null,"11.b. Filtering Practice #2",null,"11.b. Filtering Practice #2",null,"11.b. Filtering Practice #2",null,null,null,"11.b. Filtering Practice #2"]
["12.a. Constructed Wetland #1",null,"12.a. Constructed Wetland #1",null,"12.a. Constructed Wetland #1",null,"12.a. Constructed Wetland #1",null,null,null,"12.a. Constructed Wetland #1"]
["12.b. Constructed Wetland #2",null,"12.b. Constructed Wetland #2",null,"12.b. Constructed Wetland #2",null,"12.b. Constructed Wetland #2",null,null,null,"12.b. Constructed Wetland #2"]
["13.a. Wet Pond #1",null,{"$f":"P152","v":"13.b. Wet Pond #1 (Coastal Plain)"},null,"13.a. Wet Pond #1",null,"13.a. Wet Pond #1",null,null,null,"13.a. Wet Pond #1"]
[{"$f":"P155","v":"14.a. MTD - Hydrodynamic"},null,{"$f":"P155","v":"14.a. MTD - Hydrodynamic"},null,"13.b. Wet Pond #1 (Coastal Plain)",null,"13.b. Wet Pond #1 (Coastal Plain)",null,null,null,"13.b. Wet Pond #1 (Coastal Plain)"]
[{"$f":"P156","v":"14.b. MTD - Filtering"},null,{"$f":"P156","v":"14.b. MTD - Filtering"},null,"13.c. Wet Pond #2",null,"13.c. Wet Pond #2",null,null,null,"13.c. Wet Pond #2"]
[{"$f":"P157","v":"14.c. MTD - Generic"},null,{"$f":"P157","v":"14.c. MTD - Generic"},null,"13.d. Wet Pond #2 (Coastal Plain)",null,"13.d. Wet Pond #2 (Coastal Plain)",null,null,null,"13.d. Wet Pond #2 (Coastal Plain)"]
[null,null,null,null,{"$f":"P156","v":"14.b. MTD - Filtering"}]

{"sheet":"D.A. B","index":2,"n_rows":278,"n_cols":27,"rows_kept":278,"cut":false,"hidden":false,"merged":[[13,13,13,14],[0,3,0,4],[6,8,6,11],[7,8,7,11],[10,13,10,14],[12,13,12,14],[31,13,31,14],[16,13,16,14],[17,13,17,14],[18,13,18,14],[19,13,19,14],[20,13,20,14],[21,13,21,14],[22,13,22,14],[23,13,23,14],[24,13,24,14],[27,13,27,14],[28,13,28,14],[54,13,54,14],[51,16,51,19],[52,13,52,14],[32,13,32,14],[33,13,33,14],[36,13,36,14],[37,13,37,14],[40,13,40,14],[41,13,41,14],[44,13,44,14],[45,13,45,14],[48,13,48,14],[49,13,49,14],[53,13,53,14],[69,1,69,2],[69,15,69,16],[70,17,70,19],[88,0,88,1],[88,17,88,19],[72,13,72,14],[74,16,74,18],[75,13,75,14],[76,13,76,14],[79,13,79,14],[80,13,80,14],[71,13,71,14],[89,13,89,14],[90,13,90,14],[91,13,91,14],[82,16,82,17],[83,13,83,14],[84,13,84,14],[85,13,85,14],[86,13,86,14]]}
["Drainage Area B"]
[null,null,null,null,null,null,null,null,null,null,null,null,null,null,null,null,null,null,null,null,null,null,null,null,"Check Areas!",null,"CHECK AREAS!"]
["Drainage Area A Land Cover  (acres)",{"$f":"IF($F$8>Site!$F$27,\"Drainage area is greater than site area!\",(IF(OR(F5>Site!F24,F6>Site!F25,F7>Site!F26),\"Check Site Tab land cover areas!\",\"\")))","v":""}]
[null,"A Soils","B Soils","C Soils","D Soils","Totals","Land Cover Rv",null,null,null,null,null,null,"`"]
["Forest/Open Space (acres)",null,null,null,null,{"$f":"SUMIF(B5:E5,\">=0\")","v":0},{"$f":"IF(F5>0,(B5*Site!E32+C5*Site!F32+D5*Site!G32+E5*Site!H32)/F5,0)","v":0}]
["Managed Turf (acres)",null,null,null,null,{"$f":"SUMIF(B6:E6,\">=0\")","v":0},{"$f":"IF(F6>0,(B6*Site!E33+C6*Site!F33+D6*Site!G33+E6*Site!H33)/F6,0)","v":0}]
["Impervious Cover (acres) ",null,null,null,null,{"$f":"SUMIF(B7:E7,\">=0\")","v":0},{"$f":"IF(F7>0,((B7*Site!E34+C7*Site!F34+D7*Site!G34+E7*Site!H34)/F7),0)","v":0},null,"     Total Phosphorus Available for Removal in D.A. B (lb/yr)",null,null,null,{"$f":"Site!$B$31*Site!$B$36*($M$8/Site!$B$32)*Site!$B$33*2.72/43560","v":0}]
[null,null,null,null,"Total",{"$f":"SUM(F5:F7)","v":0},null,null,"Post Development Treatment Volume in D.A. B (ft3)",null,null,null,{"$f":"IFERROR(Site!B32/12*(F6*G6+F7*G7)/(F6+F7)*(F6+F7)*43560,0)","v":0}]
[]
["Stormwater Best Management Practices (RR = Runoff Reduction)",null,null,null,null,null,null,null,null,null,null,null,null,"--Select from dropdown lists--"]
["Practice","Runoff Reduction Credit (%)","Managed Turf Credit Area (acres) ","Impervious Cover Credit Area (acres)","Volume from Upstream Practice (ft3)","Runoff Reduction (ft3)","Remaining Runoff Volume  (ft3)","Total BMP Treatment Volume (ft3)","Phosphorus Removal Efficiency (%)","Phosphorus Load from Upstream Practices (lb)","Untreated Phosphorus Load to Practice (lb)","Phosphorus Removed By Practice (lb)","Remaining Phosphorus Load (lb)","Downstream Practice to be Employed",null,null,"Nitrogen Removal Efficiency (%)","Nitrogen Load from Upstream  Practices (lbs)","Untreated Nitrogen Load to Practice (lbs)","Nitrogen Removed By Practice (lbs)","Remaining Nitrogen Load (lbs)"]
["1. Vegetated Roof (RR)",null,null,null,null,null,null,null,null,null,null,null,null,null,null,null,"1. Vegetated Roof (RR)"]
["1.a. Vegetated Roof #1 (Spec #5)",45,null,null,null,{"$f":"(Site!$B$32*($G$7*$D13)*3630)*$B13/100","v":0},{"$f":"(Site!$B$32*($G$7*$D13)*3630)*(1-$B13/100)","v":0},{"$f":"+$F13+$G13","v":0},0,null,{"$f":"(Site!$B$32*($G$7*$D13)*3630)*Site!$B$33*0.3048^3/454*Site!$B$31/Site!$B$32*Site!$B$36","v":0},{"$f":"IFERROR($K13*($F13+$G13*$I13/100)/($H13),0)","v":0},{"$f":"$K13-$L13","v":0},null,null,null,0,null,{"$f":"(Site!$B$32*$G$7*$D13*3630)*Site!$B$34*0.3048^3/454*Site!$B$31/Site!$B$32*Site!$B$36","v":0},{"$f":"IFERROR($S13*($F13+$G13*$Q13/100)/$H13,0)","v":0},{"$f":"$S13-$T13","v":0}]
["1.b. Vegetated Roof #2 (Spec #5)",60,null,null,null,{"$f":"(Site!$B$32*($G$7*$D14)*3630)*$B14/100","v":0},{"$f":"(Site!$B$32*($G$7*$D14)*3630)*(1-$B14/100)","v":0},{"$f":"+$F14+$G14","v":0},0,null,{"$f":"(Site!$B$32*($G$7*$D14)*3630)*Site!$B$33*0.3048^3/454*Site!$B$31/Site!$B$32*Site!$B$36","v":0},{"$f":"IFERROR($K14*($F14+$G14*$I14/100)/($H14),0)","v":0},{"$f":"$K14-$L14","v":0},null,null,null,0,null,{"$f":"(Site!$B$32*$G$7*$D14*3630)*Site!$B$34*0.3048^3/454*Site!$B$31/Site!$B$32*Site!$B$36","v":0},{"$f":"IFERROR($S14*($F14+$G14*$Q14/100)/$H14,0)","v":0},{"$f":"$S14-$T14","v":0}]
[]
["2. Rooftop Disconnection (RR)",null,null,null,null,null,null,null,null,null,null,null,null,null,null,null,"2. Rooftop Disconnection (RR)"]
["2.a. Simple Disconnection to A/B Soils \n(Spec #1)",50,null,null,{"$f":"SUMIF($N$13:$N$92,$P121,$G$13:$G$92)","v":0},{"$f":"(Site!$B$32*($G$6*$C17+$G$7*$D17)*3630+$E17)*$B17/100","v":0},{"$f":"(Site!$B$32*($G$6*$C17+$G$7*$D17)*3630+$E17)*(1-$B17/100)","v":0},{"$f":"+$F17+$G17","v":0},0,{"$f":"SUMIF($N$13:$N$92,$P121,$M$13:$M$92)","v":0},{"$f":"(Site!$B$32*($G$6*$C17+$G$7*$D17)*3630)*Site!$B$33*0.3048^3/454*Site!$B$31/Site!$B$32*Site!$B$36","v":0},{"$f":"IFERROR(($J17+$K17)*($F17+$G17*$I17/100)/$H17,0)","v":0},{"$f":"$J17+$K17-$L17","v":0},null,null,null,0,{"$f":"SUMIF($N$13:$N$92,$P121,$U$13:$U$92)","v":0},{"$f":"(Site!$B$32*$G$7*$D17*3630)*Site!$B$34*0.3048^3/454*Site!$B$31/Site!$B$32*Site!$B$36","v":0},{"$f":"IFERROR(($R17+$S17)*($F17+$G17*$Q17/100)/$H17,0)","v":0},{"$f":"$R17+$S17-$T17","v":0}]
["2.b. Simple Disconnection to C/D Soils \n(Spec #1)",25,null,null,{"$f":"SUMIF($N$13:$N$92,$P122,$G$13:$G$92)","v":0},{"$f":"(Site!$B$32*($G$6*$C18+$G$7*$D18)*3630+$E18)*$B18/100","v":0},{"$f":"(Site!$B$32*($G$6*$C18+$G$7*$D18)*3630+$E18)*(1-$B18/100)","v":0},{"$f":"+$F18+$G18","v":0},0,{"$f":"SUMIF($N$13:$N$92,$P122,$M$13:$M$92)","v":0},{"$f":"(Site!$B$32*($G$6*$C18+$G$7*$D18)*3630)*Site!$B$33*0.3048^3/454*Site!$B$31/Site!$B$32*Site!$B$36","v":0},{"$f":"IFERROR(($J18+$K18)*($F18+$G18*$I18/100)/$H18,0)","v":0},0,null,null,null,0,{"$f":"SUMIF($N$13:$N$92,$P122,$U$13:$U$92)","v":0},{"$f":"(Site!$B$32*$G$7*$D18*3630)*Site!$B$34*0.3048^3/454*Site!$B$31/Site!$B$32*Site!$B$36","v":0},{"$f":"IFERROR(($R18+$S18)*($F18+$G18*$Q18/100)/$H18,0)","v":0},0]
["2.c. To Soil Amended Filter Path as per specifications (existing C/D soils) (Spec #4)",50,null,null,0,{"$f":"(Site!$B$32*($G$6*$C19+$G$7*$D19)*3630+$E19)*$B19/100","v":0},{"$f":"(Site!$B$32*($G$6*$C19+$G$7*$D19)*3630+$E19)*(1-$B19/100)","v":0},0,0,0,{"$f":"(Site!$B$32*($G$6*$C19+$G$7*$D19)*3630)*Site!$B$33*0.3048^3/454*Site!$B$31/Site!$B$32*Site!$B$36","v":0},0,0,null,null,null,0,0,{"$f":"(Site!$B$32*$G$7*$D19*3630)*Site!$B$34*0.3048^3/454*Site!$B$31/Site!$B$32*Site!$B$36","v":0},0,0]
["2.d. To Dry Well or French Drain #1, \nMicro-Infilration #1 (Spec #8)",50,null,null,0,{"$f":"(Site!$B$32*($G$6*$C20+$G$7*$D20)*3630+$E20)*$B20/100","v":0},{"$f":"(Site!$B$32*($G$6*$C20+$G$7*$D20)*3630+$E20)*(1-$B20/100)","v":0},0,25,0,{"$f":"(Site!$B$32*($G$6*$C20+$G$7*$D20)*3630)*Site!$B$33*0.3048^3/454*Site!$B$31/Site!$B$32*Site!$B$36","v":0},0,0,null,null,null,15,0,{"$f":"(Site!$B$32*$G$7*$D20*3630)*Site!$B$34*0.3048^3/454*Site!$B$31/Site!$B$32*Site!$B$36","v":0},0,0]
["2.e. To Dry Well or French Drain #2, \nMicro-Infiltration #2 (Spec #8)",90,null,null,0,{"$f":"(Site!$B$32*($G$6*$C21+$G$7*$D21)*3630+$E21)*$B21/100","v":0},{"$f":"(Site!$B$32*($G$6*$C21+$G$7*$D21)*3630+$E21)*(1-$B21/100)","v":0},0,25,0,{"$f":"(Site!$B$32*($G$6*$C21+$G$7*$D21)*3630)*Site!$B$33*0.3048^3/454*Site!$B$31/Site!$B$32*Site!$B$36","v":0},0,0,null,null,null,15,0,{"$f":"(Site!$B$32*$G$7*$D21*3630)*Site!$B$34*0.3048^3/454*Site!$B$31/Site!$B$32*Site!$B$36","v":0},0,0]
["2.f. To Rain Garden #1, \nMicro-Bioretention #1 (Spec #9)",40,null,null,0,{"$f":"(Site!$B$32*($G$6*$C22+$G$7*$D22)*3630+$E22)*$B22/100","v":0},{"$f":"(Site!$B$32*($G$6*$C22+$G$7*$D22)*3630+$E22)*(1-$B22/100)","v":0},0,25,0,{"$f":"(Site!$B$32*($G$6*$C22+$G$7*$D22)*3630)*Site!$B$33*0.3048^3/454*Site!$B$31/Site!$B$32*Site!$B$36","v":0},0,0,null,null,null,40,0,{"$f":"(Site!$B$32*$G$7*$D22*3630)*Site!$B$34*0.3048^3/454*Site!$B$31/Site!$B$32*Site!$B$36","v":0},0,0]
["2.g. To Rain Garden #2, \nMicro-Bioretention #2 (Spec #9)",80,null,null,0,{"$f":"(Site!$B$32*($G$6*$C23+$G$7*$D23)*3630+$E23)*$B23/100","v":0},{"$f":"(Site!$B$32*($G$6*$C23+$G$7*$D23)*3630+$E23)*(1-$B23/100)","v":0},0,50,0,{"$f":"(Site!$B$32*($G$6*$C23+$G$7*$D23)*3630)*Site!$B$33*0.3048^3/454*Site!$B$31/Site!$B$32*Site!$B$36","v":0},0,0,null,null,null,60,0,{"$f":"(Site!$B$32*$G$7*$D23*3630)*Site!$B$34*0.3048^3/454*Site!$B$31/Site!$B$32*Site!$B$36","v":0},0,0]
["2.h. To Rainwater Harvesting (Spec #6)",0,null,null,0,{"$f":"(Site!$B$32*($G$6*$C24+$G$7*$D24)*3630+$E24)*$B24/100","v":0},{"$f":"(Site!$B$32*($G$6*$C24+$G$7*$D24)*3630+$E24)*(1-$B24/100)","v":0},0,0,0,{"$f":"(Site!$B$32*($G$6*$C24+$G$7*$D24)*3630)*Site!$B$33*0.3048^3/454*Site!$B$31/Site!$B$32*Site!$B$36","v":0},0,0,null,null,null,0,0,{"$f":"(Site!$B$32*$G$7*$D24*3630)*Site!$B$34*0.3048^3/454*Site!$B$31/Site!$B$32*Site!$B$36","v":0},0,0]
["2.i. To Stormwater Planter, \nUrban Bioretention (Spec #9, Appendix A)",40,null,null,0,{"$f":"(Site!$B$32*($G$6*$C25+$G$7*$D25)*3630+$E25)*$B25/100","v":0},{"$f":"(Site!$B$32*($G$6*$C25+$G$7*$D25)*3630+$E25)*(1-$B25/100)","v":0},0,25,0,{"$f":"(Site!$B$32*($G$6*$C25+$G$7*$D25)*3630)*Site!$B$33*0.3048^3/454*Site!$B$31/Site!$B$32*Site!$B$36","v":0},0,0,null,null,null,40,0,{"$f":"(Site!$B$32*$G$7*$D25*3630)*Site!$B$34*0.3048^3/454*Site!$B$31/Site!$B$32*Site!$B$36","v":0},0,0]
[]
["3. Permeable Pavement  (RR)",null,null,null,null,null,null,null,null,null,null,null,null,null,null,null,"3. Permeable Pavement  (RR)"]
["3.a. Permeable Pavement #1 (Spec #7)",45,null,null,{"$f":"SUMIF($N$13:$N$92,$P130,$G$13:$G$92)","v":0},{"$f":"(Site!$B$32*($G$6*$C28+$G$7*$D28)*3630+$E28)*$B28/100","v":0},{"$f":"(Site!$B$32*($G$6*$C28+$G$7*$D28)*3630+$E28)*(1-$B28/100)","v":0},{"$f":"+$F28+$G28","v":0},25,{"$f":"SUMIF($N$13:$N$92,$P130,$M$13:$M$92)","v":0},{"$f":"(Site!$B$32*($G$6*$C28+$G$7*$D28)*3630)*Site!$B$33*0.3048^3/454*Site!$B$31/Site!$B$32*Site!$B$36","v":0},{"$f":"IFERROR(($J28+$K28)*($F28+$G28*$I28/100)/$H28,0)","v":0},{"$f":"$J28+$K28-$L28","v":0},null,null,null,25,{"$f":"SUMIF($N$13:$N$92,$P130,$U$13:$U$92)","v":0},{"$f":"(Site!$B$32*($G$6*$C28+$G$7*$D28)*3630)*Site!$B$34*0.3048^3/454*Site!$B$31/Site!$B$32*Site!$B$36","v":0},{"$f":"IFERROR(($R28+$S28)*($F28+$G28*$Q28/100)/$H28,0)","v":0},{"$f":"$R28+$S28-$T28","v":0}]
["3.b. Permeable Pavement #2 (Spec #7)",75,null,null,null,{"$f":"(Site!$B$32*($G$6*$C29+$G$7*$D29)*3630+$E29)*$B29/100","v":0},{"$f":"(Site!$B$32*($G$6*$C29+$G$7*$D29)*3630+$E29)*(1-$B29/100)","v":0},{"$f":"+$F29+$G29","v":0},25,null,{"$f":"(Site!$B$32*($G$6*$C29+$G$7*$D29)*3630)*Site!$B$33*0.3048^3/454*Site!$B$31/Site!$B$32*Site!$B$36","v":0},{"$f":"IFERROR(($J29+$K29)*($F29+$G29*$I29/100)/$H29,0)","v":0},{"$f":"$K29-$L29","v":0},null,null,null,25,null,{"$f":"(Site!$B$32*$G$7*$D29*3630)*Site!$B$34*0.3048^3/454*Site!$B$31/Site!$B$32*Site!$B$36","v":0},{"$f":"IFERROR(($R29+$S29)*($F29+$G29*$Q29/100)/$H29,0)","v":0},{"$f":"$R29+$S29-$T29","v":0}]
[]
["4. Grass Channel (RR)",null,null,null,null,null,null,null,null,null,null,null,null,null,null,null,"4. Grass Channel (RR)"]
["4.a. Grass Channel A/B Soils (Spec #3)",20,null,null,{"$f":"SUMIF($N$13:$N$92,$P131,$G$13:$G$92)","v":0},{"$f":"(Site!$B$32*($G$6*$C32+$G$7*$D32)*3630+$E32)*$B32/100","v":0},{"$f":"(Site!$B$32*($G$6*$C32+$G$7*$D32)*3630+$E32)*(1-$B32/100)","v":0},{"$f":"+$F32+$G32","v":0},15,{"$f":"SUMIF($N$13:$N$92,$P131,$M$13:$M$92)","v":0},{"$f":"(Site!$B$32*($G$6*$C32+$G$7*$D32)*3630)*Site!$B$33*0.3048^3/454*Site!$B$31/Site!$B$32*Site!$B$36","v":0},{"$f":"IFERROR(($J32+$K32)*($F32+$G32*$I32/100)/$H32,0)","v":0},{"$f":"$J32+$K32-$L32","v":0},null,null,null,20,{"$f":"SUMIF($N$13:$N$92,$P131,$U$13:$U$92)","v":0},{"$f":"(Site!$B$32*($G$6*$C32+$G$7*$D32)*3630)*Site!$B$34*0.3048^3/454*Site!$B$31/Site!$B$32*Site!$B$36","v":0},{"$f":"IFERROR(($R32+$S32)*($F32+$G32*$Q32/100)/$H32,0)","v":0},{"$f":"$R32+$S32-$T32","v":0}]
["4.b. Grass Channel C/D Soils (Spec #3)",10,null,null,{"$f":"SUMIF($N$13:$N$92,$P132,$G$13:$G$92)","v":0},{"$f":"(Site!$B$32*($G$6*$C33+$G$7*$D33)*3630+$E33)*$B33/100","v":0},{"$f":"(Site!$B$32*($G$6*$C33+$G$7*$D33)*3630+$E33)*(1-$B33/100)","v":0},{"$f":"+$F33+$G33","v":0},15,{"$f":"SUMIF($N$13:$N$92,$P132,$M$13:$M$92)","v":0},{"$f":"(Site!$B$32*($G$6*$C33+$G$7*$D33)*3630)*Site!$B$33*0.3048^3/454*Site!$B$31/Site!$B$32*Site!$B$36","v":0},{"$f":"IFERROR(($J33+$K33)*($F33+$G33*$I33/100)/$H33,0)","v":0},{"$f":"$J33+$K33-$L33","v":0},null,null,null,20,{"$f":"SUMIF($N$13:$N$92,$P132,$U$13:$U$92)","v":0},{"$f":"(Site!$B$32*($G$6*$C33+$G$7*$D33)*3630)*Site!$B$34*0.3048^3/454*Site!$B$31/Site!$B$32*Site!$B$36","v":0},{"$f":"IFERROR(($R33+$S33)*($F33+$G33*$Q33/100)/$H33,0)","v":0},{"$f":"$R33+$S33-$T33","v":0}]
["4.c. Grass Channel with Compost Amended Soils as per specs (see Spec #4)",{"$f":"IF(Site!$J$11=\"2011 Stds & Specs\",30,20)","v":20},null,null,0,{"$f":"(Site!$B$32*($G$6*$C34+$G$7*$D34)*3630+$E34)*$B34/100","v":0},{"$f":"(Site!$B$32*($G$6*$C34+$G$7*$D34)*3630+$E34)*(1-$B34/100)","v":0},0,15,{"$f":"SUMIF($N$13:$N$92,$P133,$M$13:$M$92)","v":0},{"$f":"(Site!$B$32*($G$6*$C34+$G$7*$D34)*3630)*Site!$B$33*0.3048^3/454*Site!$B$31/Site!$B$32*Site!$B$36","v":0},0,0,null,null,null,20,0,{"$f":"(Site!$B$32*($G$6*$C34+$G$7*$D34)*3630)*Site!$B$34*0.3048^3/454*Site!$B$31/Site!$B$32*Site!$B$36","v":0},0,0]
[null,null,null,null,null,null,null,null,null,null,null,null,null,null,null,null,null,null,null,null,null,null,"`"]
["5. Dry Swale (RR)",null,null,null,null,null,null,null,null,null,null,null,null,null,null,null,"5. Dry Swale (RR)"]
["5.a. Dry Swale #1 (Spec #10)",40,null,null,{"$f":"SUMIF($N$13:$N$92,$P134,$G$13:$G$92)","v":0},{"$f":"(Site!$B$32*($G$6*$C37+$G$7*$D37)*3630+$E37)*$B37/100","v":0},{"$f":"(Site!$B$32*($G$6*$C37+$G$7*$D37)*3630+$E37)*(1-$B37/100)","v":0},{"$f":"+$F37+$G37","v":0},20,{"$f":"SUMIF($N$13:$N$92,$P134,$M$13:$M$92)","v":0},{"$f":"(Site!$B$32*($G$6*$C37+$G$7*$D37)*3630)*Site!$B$33*0.3048^3/454*Site!$B$31/Site!$B$32*Site!$B$36","v":0},{"$f":"IFERROR(($J37+$K37)*($F37+$G37*$I37/100)/$H37,0)","v":0},{"$f":"$J37+$K37-$L37","v":0},null,null,null,25,{"$f":"SUMIF($N$13:$N$92,$P134,$U$13:$U$92)","v":0},{"$f":"(Site!$B$32*($G$6*$C37+$G$7*$D37)*3630)*Site!$B$34*0.3048^3/454*Site!$B$31/Site!$B$32*Site!$B$36","v":0},{"$f":"IFERROR(($R37+$S37)*($F37+$G37*$Q37/100)/$H37,0)","v":0},{"$f":"$R37+$S37-$T37","v":0}]
["5.b. Dry Swale #2 (Spec #10)",60,null,null,{"$f":"SUMIF($N$13:$N$92,$P135,$G$13:$G$92)","v":0},{"$f":"(Site!$B$32*($G$6*$C38+$G$7*$D38)*3630+$E38)*$B38/100","v":0},{"$f":"(Site!$B$32*($G$6*$C38+$G$7*$D38)*3630+$E38)*(1-$B38/100)","v":0},{"$f":"+$F38+$G38","v":0},40,{"$f":"SUMIF($N$13:$N$92,$P135,$M$13:$M$92)","v":0},{"$f":"(Site!$B$32*($G$6*$C38+$G$7*$D38)*3630)*Site!$B$33*0.3048^3/454*Site!$B$31/Site!$B$32*Site!$B$36","v":0},{"$f":"IFERROR(($J38+$K38)*($F38+$G38*$I38/100)/$H38,0)","v":0},{"$f":"$J38+$K38-$L38","v":0},null,null,null,35,{"$f":"SUMIF($N$13:$N$92,$P135,$U$13:$U$92)","v":0},{"$f":"(Site!$B$32*($G$6*$C38+$G$7*$D38)*3630)*Site!$B$34*0.3048^3/454*Site!$B$31/Site!$B$32*Site!$B$36","v":0},0,0]
[]
["6. Bioretention (RR)",null,null,null,null,null,null,null,null,null,null,null,null,null,null,null,"6. Bioretention (RR)"]
["6.a. Bioretention #1 or Micro-Bioretention #1 or Urban Bioretention (Spec #9)",40,null,null,{"$f":"SUMIF($N$13:$N$92,$P136,$G$13:$G$92)","v":0},{"$f":"(Site!$B$32*($G$6*$C41+$G$7*$D41)*3630+$E41)*$B41/100","v":0},{"$f":"(Site!$B$32*($G$6*$C41+$G$7*$D41)*3630+$E41)*(1-$B41/100)","v":0},{"$f":"+$F41+$G41","v":0},25,{"$f":"SUMIF($N$13:$N$92,$P136,$M$13:$M$92)","v":0},{"$f":"(Site!$B$32*($G$6*$C41+$G$7*$D41)*3630)*Site!$B$33*0.3048^3/454*Site!$B$31/Site!$B$32*Site!$B$36","v":0},{"$f":"IFERROR(($J41+$K41)*($F41+$G41*$I41/100)/$H41,0)","v":0},{"$f":"$J41+$K41-$L41","v":0},null,null,null,40,{"$f":"SUMIF($N$13:$N$92,$P136,$U$13:$U$92)","v":0},{"$f":"(Site!$B$32*($G$6*$C41+$G$7*$D41)*3630)*Site!$B$34*0.3048^3/454*Site!$B$31/Site!$B$32*Site!$B$36","v":0},{"$f":"IFERROR(($R41+$S41)*($F41+$G41*$Q41/100)/$H41,0)","v":0},{"$f":"$R41+$S41-$T41","v":0}]
["6.b. Bioretention #2 or Micro-Bioretention #2 (Spec #9)",80,null,null,{"$f":"SUMIF($N$13:$N$92,$P137,$G$13:$G$92)","v":0},{"$f":"(Site!$B$32*($G$6*$C42+$G$7*$D42)*3630+$E42)*$B42/100","v":0},{"$f":"(Site!$B$32*($G$6*$C42+$G$7*$D42)*3630+$E42)*(1-$B42/100)","v":0},{"$f":"+$F42+$G42","v":0},50,{"$f":"SUMIF($N$13:$N$92,$P137,$M$13:$M$92)","v":0},{"$f":"(Site!$B$32*($G$6*$C42+$G$7*$D42)*3630)*Site!$B$33*0.3048^3/454*Site!$B$31/Site!$B$32*Site!$B$36","v":0},{"$f":"IFERROR(($J42+$K42)*($F42+$G42*$I42/100)/$H42,0)","v":0},{"$f":"$J42+$K42-$L42","v":0},null,null,null,60,{"$f":"SUMIF($N$13:$N$92,$P137,$U$13:$U$92)","v":0},{"$f":"(Site!$B$32*($G$6*$C42+$G$7*$D42)*3630)*Site!$B$34*0.3048^3/454*Site!$B$31/Site!$B$32*Site!$B$36","v":0},0,0]
[]
["7. Infiltration (RR)",null,null,null,null,null,null,null,null,null,null,null,null,null,null,null,"7. Infiltration (RR)"]
["7.a. Infiltration #1 (Spec #8)",50,null,null,{"$f":"SUMIF($N$13:$N$92,$P138,$G$13:$G$92)","v":0},{"$f":"(Site!$B$32*($G$6*$C45+$G$7*$D45)*3630+$E45)*$B45/100","v":0},{"$f":"(Site!$B$32*($G$6*$C45+$G$7*$D45)*3630+$E45)*(1-$B45/100)","v":0},{"$f":"+$F45+$G45","v":0},25,{"$f":"SUMIF($N$13:$N$92,$P138,$M$13:$M$92)","v":0},{"$f":"(Site!$B$32*($G$6*$C45+$G$7*$D45)*3630)*Site!$B$33*0.3048^3/454*Site!$B$31/Site!$B$32*Site!$B$36","v":0},{"$f":"IFERROR(($J45+$K45)*($F45+$G45*$I45/100)/$H45,0)","v":0},{"$f":"$J45+$K45-$L45","v":0},null,null,null,15,{"$f":"SUMIF($N$13:$N$92,$P138,$U$13:$U$92)","v":0},{"$f":"(Site!$B$32*($G$6*$C45+$G$7*$D45)*3630)*Site!$B$34*0.3048^3/454*Site!$B$31/Site!$B$32*Site!$B$36","v":0},{"$f":"IFERROR(($R45+$S45)*($F45+$G45*$Q45/100)/$H45,0)","v":0},{"$f":"$R45+$S45-$T45","v":0}]
["7.b. Infiltration #2 (Spec #8)",90,null,null,{"$f":"SUMIF($N$13:$N$92,$P139,$G$13:$G$92)","v":0},{"$f":"(Site!$B$32*($G$6*$C46+$G$7*$D46)*3630+$E46)*$B46/100","v":0},{"$f":"(Site!$B$32*($G$6*$C46+$G$7*$D46)*3630+$E46)*(1-$B46/100)","v":0},{"$f":"+$F46+$G46","v":0},25,{"$f":"SUMIF($N$13:$N$92,$P139,$M$13:$M$92)","v":0},{"$f":"(Site!$B$32*($G$6*$C46+$G$7*$D46)*3630)*Site!$B$33*0.3048^3/454*Site!$B$31/Site!$B$32*Site!$B$36","v":0},{"$f":"IFERROR(($J46+$K46)*($F46+$G46*$I46/100)/$H46,0)","v":0},{"$f":"$J46+$K46-$L46","v":0},null,null,null,15,{"$f":"SUMIF($N$13:$N$92,$P139,$U$13:$U$92)","v":0},{"$f":"(Site!$B$32*($G$6*$C46+$G$7*$D46)*3630)*Site!$B$34*0.3048^3/454*Site!$B$31/Site!$B$32*Site!$B$36","v":0},0,0]
[]
["8. Extended Detention Pond (RR)",null,null,null,null,null,null,null,null,null,null,null,null,null,null,null,"8. Extended Detention Pond (RR)"]
["8.a. ED #1 (Spec #15)",0,null,null,{"$f":"SUMIF($N$13:$N$92,$P140,$G$13:$G$92)","v":0},{"$f":"(Site!$B$32*($G$6*$C49+$G$7*$D49)*3630+$E49)*$B49/100","v":0},{"$f":"(Site!$B$32*($G$6*$C49+$G$7*$D49)*3630+$E49)*(1-$B49/100)","v":0},{"$f":"+$F49+$G49","v":0},15,{"$f":"SUMIF($N$13:$N$92,$P140,$M$13:$M$92)","v":0},{"$f":"(Site!$B$32*($G$6*$C49+$G$7*$D49)*3630)*Site!$B$33*0.3048^3/454*Site!$B$31/Site!$B$32*Site!$B$36","v":0},{"$f":"IFERROR(($J49+$K49)*($F49+$G49*$I49/100)/$H49,0)","v":0},{"$f":"$J49+$K49-$L49","v":0},null,null,null,10,{"$f":"SUMIF($N$13:$N$92,$P140,$U$13:$U$92)","v":0},{"$f":"(Site!$B$32*($G$6*$C49+$G$7*$D49)*3630)*Site!$B$34*0.3048^3/454*Site!$B$31/Site!$B$32*Site!$B$36","v":0},{"$f":"IFERROR(($R49+$S49)*($F49+$G49*$Q49/100)/$H49,0)","v":0},{"$f":"$R49+$S49-$T49","v":0}]
["8.b. ED #2 (Spec #15)",15,null,null,{"$f":"SUMIF($N$13:$N$92,$P141,$G$13:$G$92)","v":0},{"$f":"(Site!$B$32*($G$6*$C50+$G$7*$D50)*3630+$E50)*$B50/100","v":0},{"$f":"(Site!$B$32*($G$6*$C50+$G$7*$D50)*3630+$E50)*(1-$B50/100)","v":0},{"$f":"+$F50+$G50","v":0},15,{"$f":"SUMIF($N$13:$N$92,$P141,$M$13:$M$92)","v":0},{"$f":"(Site!$B$32*($G$6*$C50+$G$7*$D50)*3630)*Site!$B$33*0.3048^3/454*Site!$B$31/Site!$B$32*Site!$B$36","v":0},0,0,null,null,null,10,{"$f":"SUMIF($N$13:$N$92,$P141,$U$13:$U$92)","v":0},{"$f":"(Site!$B$32*($G$6*$C50+$G$7*$D50)*3630)*Site!$B$34*0.3048^3/454*Site!$B$31/Site!$B$32*Site!$B$36","v":0},0,0]
[]
["9. Sheetflow to Filter/Open Space (RR)",null,null,null,null,null,null,null,null,null,null,null,null,null,null,null,"9. Sheetflow to Filter/Open Space (RR)"]
["9.a. Sheetflow to Conservation Area, A/B Soils (Spec #2)",75,null,null,{"$f":"SUMIF($N$13:$N$92,$P142,$G$13:$G$92)","v":0},{"$f":"(Site!$B$32*($G$6*$C53+$G$7*$D53)*3630+$E53)*$B53/100","v":0},{"$f":"(Site!$B$32*($G$6*$C53+$G$7*$D53)*3630+$E53)*(1-$B53/100)","v":0},{"$f":"+$F53+$G53","v":0},0,{"$f":"SUMIF($N$13:$N$92,$P142,$M$13:$M$92)","v":0},{"$f":"(Site!$B$32*($G$6*$C53+$G$7*$D53)*3630)*Site!$B$33*0.3048^3/454*Site!$B$31/Site!$B$32*Site!$B$36","v":0},{"$f":"IFERROR(($J53+$K53)*($F53+$G53*$I53/100)/$H53,0)","v":0},{"$f":"$J53+$K53-$L53","v":0},null,null,null,0,{"$f":"SUMIF($N$13:$N$92,$P142,$U$13:$U$92)","v":0},{"$f":"(Site!$B$32*($G$6*$C53+$G$7*$D53)*3630)*Site!$B$34*0.3048^3/454*Site!$B$31/Site!$B$32*Site!$B$36","v":0},{"$f":"IFERROR(($R53+$S53)*($F53+$G53*$Q53/100)/$H53,0)","v":0},{"$f":"$R53+$S53-$T53","v":0}]
["9.b. Sheetflow to Conservation Area, C/D Soils (Spec #2)",50,null,null,{"$f":"SUMIF($N$13:$N$92,$P143,$G$13:$G$92)","v":0},{"$f":"(Site!$B$32*($G$6*$C54+$G$7*$D54)*3630+$E54)*$B54/100","v":0},{"$f":"(Site!$B$32*($G$6*$C54+$G$7*$D54)*3630+$E54)*(1-$B54/100)","v":0},{"$f":"+$F54+$G54","v":0},0,{"$f":"SUMIF($N$13:$N$92,$P143,$M$13:$M$92)","v":0},{"$f":"(Site!$B$32*($G$6*$C54+$G$7*$D54)*3630)*Site!$B$33*0.3048^3/454*Site!$B$31/Site!$B$32*Site!$B$36","v":0},0,0,null,null,null,0,{"$f":"SUMIF($N$13:$N$92,$P143,$U$13:$U$92)","v":0},{"$f":"(Site!$B$32*($G$6*$C54+$G$7*$D54)*3630)*Site!$B$34*0.3048^3/454*Site!$B$31/Site!$B$32*Site!$B$36","v":0},0,0]
["9.c. Sheetflow to Vegetated Filter Strip, A Soils or Compost Amended B/C/D Soils \n(Spec #2 & #4)",50,null,null,0,{"$f":"(Site!$B$32*($G$6*$C55+$G$7*$D55)*3630+$E55)*$B55/100","v":0},{"$f":"(Site!$B$32*($G$6*$C55+$G$7*$D55)*3630+$E55)*(1-$B55/100)","v":0},0,0,0,{"$f":"(Site!$B$32*($G$6*$C55+$G$7*$D55)*3630)*Site!$B$33*0.3048^3/454*Site!$B$31/Site!$B$32*Site!$B$36","v":0},0,0,null,null,null,0,0,{"$f":"(Site!$B$32*($G$6*$C55+$G$7*$D55)*3630)*Site!$B$34*0.3048^3/454*Site!$B$31/Site!$B$32*Site!$B$36","v":0},0,0]
[]
[]
[null,null,null,null,"TOTAL IMPERVIOUS COVER TREATED (ac)",{"$f":"SUM(D13:D55)","v":0},"AREA CHECK:",{"$f":"IF(F58>$F$7,\"AREA EXCEEDED!\",\"OK.\")","v":"OK."}]
[null,null,null,null,"TOTAL TURF AREA TREATED (ac)",{"$f":"SUM(C32:C55)","v":0},"AREA CHECK:",{"$f":"IF(F59>$F$6,\"AREA EXCEEDED!\",\"OK.\")","v":"OK."}]
[null,null,null,null,"TOTAL RUNOFF REDUCTION IN D.A. B (ft3)",{"$f":"IFERROR(SUM($F$13:$F$55),0)","v":0}]
[]
[null,null,null,null,null,null,null,"TOTAL PHOSPHORUS AVAILABLE FOR REMOVAL IN D.A. B (lb/yr)",{"$f":"$M$7","v":0}]
[null,null,null,null,null,null,null,"TOTAL PHOSPHORUS REMOVED WITH RUNOFF REDUCTION PRACTICES IN D.A. B (lb/yr)",{"$f":"IFERROR(SUM(L13:L55),0)","v":0},null,null,null,null,null,null,null,null,null,null,null,"TOTAL RUNOFF REDUCTION IN D.A. B (ft3)",{"$f":"F60","v":0}]
[null,null,null,null,null,null,null,"TOTAL PHOSPHORUS REMAINING AFTER APPLYING RUNOFF REDUCTION PRACTICES IN D.A. B (lb/yr)",{"$f":"I62-I63","v":0},null,null,null,null,null,null,null,null,null,null,null,"NITROGEN REMOVED WITH RUNOFF REDUCTION PRACTICES IN D.A. B (lb/yr)",{"$f":"SUM($T$13:$T$55)","v":0}]
[]
[null,null,"SEE WATER QUALITY COMPLIANCE TAB FOR SITE COMPLIANCE CALCULATIONS",null,null,null,null,null,null,null,null,null,null,null,null,null,null,null,null,null,null,"           SEE WATER QUALITY COMPLIANCE TAB FOR SITE CALCULATIONS (Information Only)"]
[]
[]
[]
[]
["10. Wet Swale (no RR)",null,null,null,null,null,null,null,null,null,null,null,null,null,null,null,null,"10. Wet Swale (Coastal Plain) (no RR)"]
["10.a. Wet Swale #1 (Spec #11)",0,null,null,{"$f":"SUMIF($N$13:$N$92,$P145,$G$13:$G$92)","v":0},{"$f":"(Site!$B$32*($G$6*$C72+$G$7*$D72)*3630+$E72)*$B72/100","v":0},{"$f":"(Site!$B$32*($G$6*$C72+$G$7*$D72)*3630+$E72)*(1-$B72/100)","v":0},{"$f":"+$F72+$G72","v":0},20,{"$f":"SUMIF($N$13:$N$92,$P145,$M$13:$M$92)","v":0},{"$f":"(Site!$B$32*($G$6*$C72+$G$7*$D72)*3630)*Site!$B$33*0.3048^3/454*Site!$B$31/Site!$B$32*Site!$B$36","v":0},{"$f":"IFERROR(($J72+$K72)*($F72+$G72*$I72/100)/$H72,0)","v":0},{"$f":"$J72+$K72-$L72","v":0},null,null,null,25,{"$f":"SUMIF($N$13:$N$92,$P145,$U$13:$U$92)","v":0},{"$f":"(Site!$B$32*($G$6*$C72+$G$7*$D72)*3630)*Site!$B$34*0.3048^3/454*Site!$B$31/Site!$B$32*Site!$B$36","v":0},{"$f":"IFERROR(($R72+$S72)*($F72+$G72*$Q72/100)/$H72,0)","v":0},{"$f":"$R72+$S72-$T72","v":0}]
["10.b. Wet Swale #2 (Spec #11)",0,null,null,{"$f":"SUMIF($N$13:$N$92,$P146,$G$13:$G$92)","v":0},{"$f":"(Site!$B$32*($G$6*$C73+$G$7*$D73)*3630+$E73)*$B73/100","v":0},{"$f":"(Site!$B$32*($G$6*$C73+$G$7*$D73)*3630+$E73)*(1-$B73/100)","v":0},0,40,{"$f":"SUMIF($N$13:$N$92,$P146,$M$13:$M$92)","v":0},{"$f":"(Site!$B$32*($G$6*$C73+$G$7*$D73)*3630)*Site!$B$33*0.3048^3/454*Site!$B$31/Site!$B$32*Site!$B$36","v":0},0,0,null,null,null,35,{"$f":"SUMIF($N$13:$N$92,$P146,$U$13:$U$92)","v":0},{"$f":"(Site!$B$32*($G$6*$C73+$G$7*$D73)*3630)*Site!$B$34*0.3048^3/454*Site!$B$31/Site!$B$32*Site!$B$36","v":0},0,0]
[]
["11.  Filtering Practices (no RR)",null,null,null,null,null,null,null,null,null,null,null,null,null,null,null,"11.  Filtering Practices (no RR)"]
["11.a.Filtering Practice #1 (Spec #12)",0,null,null,{"$f":"SUMIF($N$13:$N$92,$P147,$G$13:$G$92)","v":0},{"$f":"(Site!$B$32*($G$6*$C76+$G$7*$D76)*3630+$E76)*$B76/100","v":0},{"$f":"(Site!$B$32*($G$6*$C76+$G$7*$D76)*3630+$E76)*(1-$B76/100)","v":0},{"$f":"+$F76+$G76","v":0},60,{"$f":"SUMIF($N$13:$N$92,$P147,$M$13:$M$92)","v":0},{"$f":"(Site!$B$32*($G$6*$C76+$G$7*$D76)*3630)*Site!$B$33*0.3048^3/454*Site!$B$31/Site!$B$32*Site!$B$36","v":0},{"$f":"IFERROR(($J76+$K76)*($F76+$G76*$I76/100)/$H76,0)","v":0},{"$f":"$J76+$K76-$L76","v":0},null,null,null,30,{"$f":"SUMIF($N$13:$N$92,$P147,$U$13:$U$92)","v":0},{"$f":"(Site!$B$32*($G$6*$C76+$G$7*$D76)*3630)*Site!$B$34*0.3048^3/454*Site!$B$31/Site!$B$32*Site!$B$36","v":0},{"$f":"IFERROR(($R76+$S76)*($F76+$G76*$Q76/100)/$H76,0)","v":0},{"$f":"$R76+$S76-$T76","v":0}]
["11.b. Filtering Practice #2 (Spec #12)",0,null,null,{"$f":"SUMIF($N$13:$N$92,$P148,$G$13:$G$92)","v":0},{"$f":"(Site!$B$32*($G$6*$C77+$G$7*$D77)*3630+$E77)*$B77/100","v":0},{"$f":"(Site!$B$32*($G$6*$C77+$G$7*$D77)*3630+$E77)*(1-$B77/100)","v":0},0,65,{"$f":"SUMIF($N$13:$N$92,$P148,$M$13:$M$92)","v":0},{"$f":"(Site!$B$32*($G$6*$C77+$G$7*$D77)*3630)*Site!$B$33*0.3048^3/454*Site!$B$31/Site!$B$32*Site!$B$36","v":0},0,0,null,null,null,45,{"$f":"SUMIF($N$13:$N$92,$P148,$U$13:$U$92)","v":0},{"$f":"(Site!$B$32*($G$6*$C77+$G$7*$D77)*3630)*Site!$B$34*0.3048^3/454*Site!$B$31/Site!$B$32*Site!$B$36","v":0},0,0]
[]
["12. Constructed Wetland (no RR)",null,null,null,null,null,null,null,null,null,null,null,null,null,null,null,"12. Constructed Wetland (no RR)"]
["12.a.Constructed Wetland #1 (Spec #13)",0,null,null,{"$f":"SUMIF($N$13:$N$92,$P149,$G$13:$G$92)","v":0},{"$f":"(Site!$B$32*($G$6*$C80+$G$7*$D80)*3630+$E80)*$B80/100","v":0},{"$f":"(Site!$B$32*($G$6*$C80+$G$7*$D80)*3630+$E80)*(1-$B80/100)","v":0},{"$f":"+$F80+$G80","v":0},50,{"$f":"SUMIF($N$13:$N$92,$P149,$M$13:$M$92)","v":0},{"$f":"(Site!$B$32*($G$6*$C80+$G$7*$D80)*3630)*Site!$B$33*0.3048^3/454*Site!$B$31/Site!$B$32*Site!$B$36","v":0},{"$f":"IFERROR(($J80+$K80)*($F80+$G80*$I80/100)/$H80,0)","v":0},{"$f":"$J80+$K80-$L80","v":0},null,null,null,25,{"$f":"SUMIF($N$13:$N$92,$P149,$U$13:$U$92)","v":0},{"$f":"(Site!$B$32*($G$6*$C80+$G$7*$D80)*3630)*Site!$B$34*0.3048^3/454*Site!$B$31/Site!$B$32*Site!$B$36","v":0},{"$f":"IFERROR(($R80+$S80)*($F80+$G80*$Q80/100)/$H80,0)","v":0},{"$f":"$R80+$S80-$T80","v":0}]
["12.b. Constructed Wetland #2 (Spec #13)",0,null,null,{"$f":"SUMIF($N$13:$N$92,$P150,$G$13:$G$92)","v":0},{"$f":"(Site!$B$32*($G$6*$C81+$G$7*$D81)*3630+$E81)*$B81/100","v":0},{"$f":"(Site!$B$32*($G$6*$C81+$G$7*$D81)*3630+$E81)*(1-$B81/100)","v":0},0,75,{"$f":"SUMIF($N$13:$N$92,$P150,$M$13:$M$92)","v":0},{"$f":"(Site!$B$32*($G$6*$C81+$G$7*$D81)*3630)*Site!$B$33*0.3048^3/454*Site!$B$31/Site!$B$32*Site!$B$36","v":0},0,0,null,null,null,55,{"$f":"SUMIF($N$13:$N$92,$P150,$U$13:$U$92)","v":0},{"$f":"(Site!$B$32*($G$6*$C81+$G$7*$D81)*3630)*Site!$B$34*0.3048^3/454*Site!$B$31/Site!$B$32*Site!$B$36","v":0},0,0]
[]
["13. Wet Ponds (no RR)",null,null,null,null,null,null,null,null,null,null,null,null,null,null,null,"13. Wet Ponds (no RR)"]
["13.a. Wet Pond #1 (Spec #14)",0,null,null,{"$f":"SUMIF($N$13:$N$92,$P151,$G$13:$G$92)","v":0},{"$f":"(Site!$B$32*($G$6*$C84+$G$7*$D84)*3630+$E84)*$B84/100","v":0},{"$f":"(Site!$B$32*($G$6*$C84+$G$7*$D84)*3630+$E84)*(1-$B84/100)","v":0},{"$f":"+$F84+$G84","v":0},50,{"$f":"SUMIF($N$13:$N$92,$P151,$M$13:$M$92)","v":0},{"$f":"(Site!$B$32*($G$6*$C84+$G$7*$D84)*3630)*Site!$B$33*0.3048^3/454*Site!$B$31/Site!$B$32*Site!$B$36","v":0},{"$f":"IFERROR(($J84+$K84)*($F84+$G84*$I84/100)/$H84,0)","v":0},{"$f":"$J84+$K84-$L84","v":0},null,null,null,30,{"$f":"SUMIF($N$13:$N$92,$P151,$U$13:$U$92)","v":0},{"$f":"(Site!$B$32*($G$6*$C84+$G$7*$D84)*3630)*Site!$B$34*0.3048^3/454*Site!$B$31/Site!$B$32*Site!$B$36","v":0},{"$f":"IFERROR(($R84+$S84)*($F84+$G84*$Q84/100)/$H84,0)","v":0},{"$f":"$R84+$S84-$T84","v":0}]
["13.b. Wet Pond #1 (Coastal Plain) (Spec #14)",0,null,null,{"$f":"SUMIF($N$13:$N$92,$P152,$G$13:$G$92)","v":0},{"$f":"(Site!$B$32*($G$6*$C85+$G$7*$D85)*3630+$E85)*$B85/100","v":0},{"$f":"(Site!$B$32*($G$6*$C85+$G$7*$D85)*3630+$E85)*(1-$B85/100)","v":0},0,45,{"$f":"SUMIF($N$13:$N$92,$P152,$M$13:$M$92)","v":0},{"$f":"(Site!$B$32*($G$6*$C85+$G$7*$D85)*3630)*Site!$B$33*0.3048^3/454*Site!$B$31/Site!$B$32*Site!$B$36","v":0},0,0,null,null,null,20,{"$f":"SUMIF($N$13:$N$92,$P152,$U$13:$U$92)","v":0},{"$f":"(Site!$B$32*($G$6*$C85+$G$7*$D85)*3630)*Site!$B$34*0.3048^3/454*Site!$B$31/Site!$B$32*Site!$B$36","v":0},0,0]
["13.c. Wet Pond #2 (Spec #14)",0,null,null,0,{"$f":"(Site!$B$32*($G$6*$C86+$G$7*$D86)*3630+$E86)*$B86/100","v":0},{"$f":"(Site!$B$32*($G$6*$C86+$G$7*$D86)*3630+$E86)*(1-$B86/100)","v":0},0,75,0,{"$f":"(Site!$B$32*($G$6*$C86+$G$7*$D86)*3630)*Site!$B$33*0.3048^3/454*Site!$B$31/Site!$B$32*Site!$B$36","v":0},0,0,null,null,null,40,0,{"$f":"(Site!$B$32*($G$6*$C86+$G$7*$D86)*3630)*Site!$B$34*0.3048^3/454*Site!$B$31/Site!$B$32*Site!$B$36","v":0},0,0]
["13.d. Wet Pond #2 (Coastal Plain) (Spec #14)",0,null,null,0,{"$f":"(Site!$B$32*($G$6*$C87+$G$7*$D87)*3630+$E87)*$B87/100","v":0},{"$f":"(Site!$B$32*($G$6*$C87+$G$7*$D87)*3630+$E87)*(1-$B87/100)","v":0},0,65,0,{"$f":"(Site!$B$32*($G$6*$C87+$G$7*$D87)*3630)*Site!$B$33*0.3048^3/454*Site!$B$31/Site!$B$32*Site!$B$36","v":0},0,0,null,null,null,30,0,{"$f":"(Site!$B$32*($G$6*$C87+$G$7*$D87)*3630)*Site!$B$34*0.3048^3/454*Site!$B$31/Site!$B$32*Site!$B$36","v":0},0,0]
[]
["14. Manufactured Treatment Devices (no RR)",null,null,null,null,null,null,null,null,null,null,null,null,null,null,null,null,"14. Manufactured BMP (no RR)"]
["14.a. Manufactured Treatment Device-Hydrodynamic",0,null,null,{"$f":"SUMIF($N$13:$N$92,$P155,$G$13:$G$92)","v":0},{"$f":"(Site!$B$32*($G$6*$C90+$G$7*$D90)*3630+$E90)*$B90/100","v":0},{"$f":"(Site!$B$32*($G$6*$C90+$G$7*$D90)*3630+$E90)*(1-$B90/100)","v":0},{"$f":"+$F90+$G90","v":0},20,{"$f":"SUMIF($N$13:$N$92,$P155,$M$13:$M$92)","v":0},{"$f":"(Site!$B$32*($G$6*$C90+$G$7*$D90)*3630)*Site!$B$33*0.3048^3/454*Site!$B$31/Site!$B$32*Site!$B$36","v":0},{"$f":"IFERROR(($J90+$K90)*($F90+$G90*$I90/100)/$H90,0)","v":0},{"$f":"$J90+$K90-$L90","v":0},null,null,null,0,{"$f":"SUMIF($N$13:$N$92,$P155,$U$13:$U$92)","v":0},{"$f":"(Site!$B$32*($G$6*$C90+$G$7*$D90)*3630)*Site!$B$34*0.3048^3/454*Site!$B$31/Site!$B$32*Site!$B$36","v":0},{"$f":"IFERROR(($R90+$S90)*($F90+$G90*$Q90/100)/$H90,0)","v":0},{"$f":"$R90+$S90-$T90","v":0}]
["14.b. Manufactured Treatment Device-Filtering",0,null,null,{"$f":"SUMIF($N$13:$N$92,$P156,$G$13:$G$92)","v":0},{"$f":"(Site!$B$32*($G$6*$C91+$G$7*$D91)*3630+$E91)*$B91/100","v":0},{"$f":"(Site!$B$32*($G$6*$C91+$G$7*$D91)*3630+$E91)*(1-$B91/100)","v":0},0,20,{"$f":"SUMIF($N$13:$N$92,$P156,$M$13:$M$92)","v":0},{"$f":"(Site!$B$32*($G$6*$C91+$G$7*$D91)*3630)*Site!$B$33*0.3048^3/454*Site!$B$31/Site!$B$32*Site!$B$36","v":0},0,0,null,null,null,0,{"$f":"SUMIF($N$13:$N$92,$P156,$U$13:$U$92)","v":0},{"$f":"(Site!$B$32*($G$6*$C91+$G$7*$D91)*3630)*Site!$B$34*0.3048^3/454*Site!$B$31/Site!$B$32*Site!$B$36","v":0},0,0]
["14.c. Manufactured Treatment Device-Generic",0,null,null,0,{"$f":"(Site!$B$32*($G$6*$C92+$G$7*$D92)*3630+$E92)*$B92/100","v":0},{"$f":"(Site!$B$32*($G$6*$C92+$G$7*$D92)*3630+$E92)*(1-$B92/100)","v":0},0,20,0,{"$f":"(Site!$B$32*($G$6*$C92+$G$7*$D92)*3630)*Site!$B$33*0.3048^3/454*Site!$B$31/Site!$B$32*Site!$B$36","v":0},0,0,null,null,null,0,0,{"$f":"(Site!$B$32*($G$6*$C92+$G$7*$D92)*3630)*Site!$B$34*0.3048^3/454*Site!$B$31/Site!$B$32*Site!$B$36","v":0},0,0]
[]
[]
[]
[null,null,null,null,"TOTAL IMPERVIOUS COVER TREATED (ac)",{"$f":"SUM($D$13:$D$92)","v":0},"AREA CHECK:",{"$f":"IF($F$96>$F$7,\"AREA EXCEEDED!\",\"OK.\")","v":"OK."}]
[null,null,null,null,"TOTAL MANAGED TURF AREA TREATED (ac)",{"$f":"SUM($C$13:$C$92)","v":0},"AREA CHECK:",{"$f":"IF($F$97>$F$6,\"AREA EXCEEDED!\",\"OK.\")","v":"OK."}]
[]
[null,null,null,null,null,null,null,"TOTAL PHOSPHORUS REMOVAL REQUIRED ON SITE (lb/yr)",{"$f":"IF(Site!G63=\"Check Areas!\",\"ERROR - \",Site!G63)","v":"--"},{"$f":"IF(I99=\"ERROR - \",\"Site Data Tab\",\"\")","v":""}]
[]
[null,null,null,null,null,null,null,"TOTAL PHOSPHORUS AVAILABLE FOR REMOVAL IN D.A. B (lb/yr)",{"$f":"$M$7","v":0}]
[null,null,null,null,null,null,null,"TOTAL PHOSPHORUS REMOVED WITHOUT RUNOFF REDUCTION PRACTICES IN D.A. B (lb/yr)",{"$f":"SUM($L$72:$L$92)","v":0}]
[null,null,null,null,null,null,null,"TOTAL PHOSPHORUS REMOVED WITH RUNOFF REDUCTION PRACTICES IN D.A. B (lb/yr)",{"$f":"$I$63","v":0}]
[null,null,null,null,null,null,null,"TOTAL PHOSPHORUS LOAD REDUCTION ACHIEVED IN D.A. B (lb/yr)",{"$f":"$I$102+$I$103","v":0}]
[null,null,null,null,null,null,null,"TOTAL PHOSPHORUS REMAINING AFTER APPLYING BMP LOAD REDUCTIONS IN D.A. B (lb/yr)",{"$f":"$I$101-$I$104","v":0}]
[]
[null,null,"SEE WATER QUALITY COMPLIANCE TAB FOR SITE COMPLIANCE CALCULATIONS"]
[]
[null,null,null,null,null,null,null,"NITROGEN REMOVED WITH RUNOFF REDUCTION PRACTICES IN D.A. B (lb/yr)",{"$f":"IFERROR(SUM($T$13:$T$55),0)","v":0}]
[null,null,null,null,null,null,null,"NITROGEN REMOVED WITHOUT RUNOFF REDUCTION PRACTICES IN D.A. B (lb/yr)",{"$f":"SUM($T$72:$T$92)","v":0}]
[null,null,null,null,null,null,null,"TOTAL NITROGEN REMOVED IN D.A. B (lb/yr)",{"$f":"$I$109+$I$110","v":0}]
[]
[]
[]
[]
[null,null,"Downstream Practices - Dropdown selections for each applicable BMP"]
[]
["Options for 1. Green Roof",null,"Options for 2. Impervious Surface Disconnection",null,"Options for 3a. Pervious Parking, A/B Soils",null,"Options for 4a. Grass Channels, A/B Soils",null,null,"Options for 4b. Grass Channels, C/D Soils"]
[null,null,null,null,null,null,null,null,null,null,null,"Options for 4.c. Grass Channel Compost Amended Soils",null,null,null,"Master Downstream BMP Reference List"]
[{"$f":"P120","v":"None"},null,{"$f":"P120","v":"None"},null,{"$f":"P120","v":"None"},null,{"$f":"P120","v":"None"},null,null,{"$f":"P120","v":"None"},null,null,null,null,null,"None"]
["2.a. Simple Disconnection to A/B Soils",null,{"$f":"P131","v":"4.a. Grass Channel A/B Soils"},null,{"$f":"P131","v":"4.a. Grass Channel A/B Soils"},null,{"$f":"P132","v":"4.b. Grass Channel C/D Soils"},null,null,{"$f":"P131","v":"4.a. Grass Channel A/B Soils"},null,{"$f":"P120","v":"None"},null,null,null,"2.a. Simple Disconnection to A/B Soils"]
["2.b. Simple Disconnection to C/D Soils",null,"4.b. Grass Channel C/D Soils",null,"4.b. Grass Channel C/D Soils",null,"4.c. Grass Channel Compost Amended Soils",null,null,{"$f":"P133","v":"4.c. Grass Channel Compost Amended Soils"},null,{"$f":"P131","v":"4.a. Grass Channel A/B Soils"},null,null,null,"2.b. Simple Disconnection to C/D Soils"]
["2.c. To Soil Amended Filter Path",null,"4.c. Grass Channel Compost Amended Soils",null,"4.c. Grass Channel Compost Amended Soils",null,"5.a. Dry Swale #1",null,null,"5.a. Dry Swale #1",null,{"$f":"P132","v":"4.b. Grass Channel C/D Soils"},null,null,null,"2.c. To Soil Amended Filter Path"]
["2.d. To Dry Well/French Drain #1 (Micro-Infiltration #1)",null,"5.a. Dry Swale #1",null,"5.a. Dry Swale #1",null,"5.b. Dry Swale #2",null,null,"5.b. Dry Swale #2",null,{"$f":"P134","v":"5.a. Dry Swale #1"},null,null,null,"2.d. To Dry Well/French Drain #1 (Micro-Infiltration #1)"]
["2.e. To Dry Well/French Drain #2 (Micro-Infiltration. #2)",null,"5.b. Dry Swale #2",null,"5.b. Dry Swale #2",null,"6.a. Bioretention #1",null,null,"6.a. Bioretention #1",null,"5.b. Dry Swale #2",null,null,null,"2.e. To Dry Well/French Drain #2 (Micro-Infiltration. #2)"]
["2.f. To Rain Garden #1 (Micro-Bioretention #1)",null,"6.a. Bioretention #1",null,"6.a. Bioretention #1",null,"6.b. Bioretention #2",null,null,"6.b. Bioretention #2",null,"6.a. Bioretention #1",null,null,null,"2.f. To Rain Garden #1 (Micro-Bioretention #1)"]
["2.g. To Rain Garden #2 (Micro-Bioretention #2)",null,"6.b. Bioretention #2",null,"6.b. Bioretention #2",null,"7.a. Infiltration #1",null,null,"7.a. Infiltration #1",null,"6.b. Bioretention #2",null,null,null,"2.g. To Rain Garden #2 (Micro-Bioretention #2)"]
["2.h. To Train Barrel, Rain Tank, or Cistern",null,"7.a. Infiltration #1",null,"7.a. Infiltration #1",null,"7.b. Infiltration #2",null,null,"7.b. Infiltration #2",null,"7.a. Infiltration #1",null,null,null,"2.h. To Train Barrel, Rain Tank, or Cistern"]
["2.i. To Stormwater Planter (Urban Bioretention)",null,"7.b. Infiltration #2",null,"7.b. Infiltration #2",null,"8.a. ED #1",null,null,"8.a. ED #1",null,"7.b. Infiltration #2",null,null,null,"2.i. To Stormwater Planter (Urban Bioretention)"]
["3.a. Permeable Pavement #1",null,"8.a. ED #1",null,"8.a. ED #1",null,"8.b. ED #2",null,null,"8.b. ED #2",null,"8.a. ED #1",null,null,null,"3.a. Permeable Pavement #1"]
["4.a. Grass Channel A/B Soils",null,"8.b. ED #2",null,"8.b. ED #2",null,"9.a. Sheetflow to A/B Soil Conservation Area ",null,null,"9.a. Sheetflow to A/B Soil Conservation Area ",null,"8.b. ED #2",null,null,null,"4.a. Grass Channel A/B Soils"]
["4.b. Grass Channel C/D Soils",null,"9.a. Sheetflow to A/B Soil Conservation Area ",null,"9.a. Sheetflow to A/B Soil Conservation Area ",null,"9.b. Sheetflow to C/D Soil Conservation Area",null,null,"9.b. Sheetflow to C/D Soil Conservation Area",null,"9.a. Sheetflow to A/B Soil Conservation Area ",null,null,null,"4.b. Grass Channel C/D Soils"]
["4.c. Grass Channel Compost Amended Soils",null,"9.b. Sheetflow to C/D Soil Conservation Area",null,"9.b. Sheetflow to C/D Soil Conservation Area",null,"9.c. Sheetflow to Vegetated Filter Strip",null,null,"9.c. Sheetflow to Vegetated Filter Strip",null,"9.b. Sheetflow to C/D Soil Conservation Area",null,null,null,"4.c. Grass Channel Compost Amended Soils"]
["5.a. Dry Swale #1",null,"9.c. Sheetflow to Vegetated Filter Strip",null,"9.c. Sheetflow to Vegetated Filter Strip",null,"10.a. Wet Swale #1",null,null,"10.a. Wet Swale #1",null,"9.c. Sheetflow to Vegetated Filter Strip",null,null,null,"5.a. Dry Swale #1"]
["5.b. Dry Swale #2",null,"10.a. Wet Swale #1",null,"10.a. Wet Swale #1",null,"10.b. Wet Swale #2",null,null,"10.b. Wet Swale #2",null,"10.a. Wet Swale #1",null,null,null,"5.b. Dry Swale #2"]
["6.a. Bioretention #1",null,"10.b. Wet Swale #2",null,"10.b. Wet Swale #2",null,"11.a. Filtering Practice #1",null,null,"11.a. Filtering Practice #1",null,"10.b. Wet Swale #2",null,null,null,"6.a. Bioretention #1"]
["6.b. Bioretention #2",null,"11.a. Filtering Practice #1",null,"11.a. Filtering Practice #1",null,"11.b. Filtering Practice #2",null,null,"11.b. Filtering Practice #2",null,"11.a. Filtering Practice #1",null,null,null,"6.b. Bioretention #2"]
["7.a. Infiltration #1",null,"11.b. Filtering Practice #2",null,"11.b. Filtering Practice #2",null,"12.a. Constructed Wetland #1",null,null,"12.a. Constructed Wetland #1",null,"11.b. Filtering Practice #2",null,null,null,"7.a. Infiltration #1"]
["7.b. Infiltration #2",null,"12.a. Constructed Wetland #1",null,"12.a. Constructed Wetland #1",null,"12.b. Constructed Wetland #2",null,null,"12.b. Constructed Wetland #2",null,"12.a. Constructed Wetland #1",null,null,null,"7.b. Infiltration #2"]
["8.a. ED #1",null,"12.b. Constructed Wetland #2",null,"12.b. Constructed Wetland #2",null,"13.a. Wet Pond #1",null,null,"13.a. Wet Pond #1",null,"12.b. Constructed Wetland #2",null,null,null,"8.a. ED #1"]
["8.b. ED #2",null,"13.a. Wet Pond #1",null,"13.a. Wet Pond #1",null,"13.b. Wet Pond #1 (Coastal Plain)",null,null,"13.b. Wet Pond #1 (Coastal Plain)",null,"13.a. Wet Pond #1",null,null,null,"8.b. ED #2"]
["9.a. Sheetflow to A/B Soil Conservation Area ",null,"13.b. Wet Pond #1 (Coastal Plain)",null,"13.b. Wet Pond #1 (Coastal Plain)",null,"13.c. Wet Pond #2",null,null,"13.c. Wet Pond #2",null,"13.b. Wet Pond #1 (Coastal Plain)",null,null,null,"9.a. Sheetflow to A/B Soil Conservation Area "]
["9.b. Sheetflow to C/D Soil Conservation Area",null,"13.c. Wet Pond #2",null,"13.c. Wet Pond #2",null,"13.d. Wet Pond #2 (Coastal Plain)",null,null,"13.d. Wet Pond #2 (Coastal Plain)",null,"13.c. Wet Pond #2",null,null,null,"9.b. Sheetflow to C/D Soil Conservation Area"]
["9.c. Sheetflow to Vegetated Filter Strip",null,"13.d. Wet Pond #2 (Coastal Plain)",null,"13.d. Wet Pond #2 (Coastal Plain)",null,"14.a. MTD - Hydrodynamic",null,null,"14.a. MTD - Hydrodynamic",null,"13.d. Wet Pond #2 (Coastal Plain)",null,null,null,"9.c. Sheetflow to Vegetated Filter Strip"]
["10.a. Wet Swale #1",null,"14.a. MTD - Hydrodynamic",null,"14.a. MTD - Hydrodynamic",null,"14.b. MTD - Filtering",null,null,"14.b. MTD - Filtering",null,"14.a. MTD - Hydrodynamic",null,null,null,"10.a. Wet Swale #1"]
["10.b. Wet Swale #2",null,"14.b. MTD - Filtering",null,"14.b. MTD - Filtering",null,"14.c. MTD - Generic",null,null,"14.c. MTD - Generic",null,"14.b. MTD - Filtering",null,null,null,"10.b. Wet Swale #2"]
["11.a. Filtering Practice #1",null,"14.c. MTD - Generic",null,"14.c. MTD - Generic",null,null,null,null,null,null,"14.c. MTD - Generic",null,null,null,"11.a. Filtering Practice #1"]
["11.b. Filtering Practice #2",null,null,null,null,null,null,null,null,null,null,null,null,null,null,"11.b. Filtering Practice #2"]
["12.a. Constructed Wetland #1",null,null,null,null,null,null,null,null,null,null,null,null,null,null,"12.a. Constructed Wetland #1"]
["12.b. Constructed Wetland #2",null,null,null,null,null,null,null,null,null,null,null,null,null,null,"12.b. Constructed Wetland #2"]
["13.a. Wet Pond #1",null,null,null,null,null,null,null,null,null,null,null,null,null,null,"13.a. Wet Pond #1"]
["13.b. Wet Pond #1 (Coastal Plain)",null,null,null,null,null,null,null,null,null,null,null,null,null,null,"13.b. Wet Pond #1 (Coastal Plain)"]
["13.c. Wet Pond #2",null,null,null,null,null,null,null,null,null,null,null,null,null,null,"13.c. Wet Pond #2"]
["13.d. Wet Pond #2 (Coastal Plain)",null,null,null,null,null,null,null,null,null,null,null,null,null,null,"13.d. Wet Pond #2 (Coastal Plain)"]
["14.a. MTD - Hydrodynamic",null,null,null,null,null,null,null,null,null,null,null,null,null,null,"14.a. MTD - Hydrodynamic"]
["14.b. MTD - Filtering",null,null,null,null,null,null,null,null,null,null,null,null,null,null,"14.b. MTD - Filtering"]
["14.c. MTD - Generic",null,null,null,null,null,null,null,null,null,null,null,null,null,null,"14.c. MTD - Generic"]
[]
["Options for 5a. Dry Swale #1",null,"Options for 5b. Dry Swale #2",null,"Options for 6a. Bioretention #1",null,"Options for 6b. Bioretention #2",null,null,"Options for 7a. Infiltration #1",null,"Options for 7b. Infiltration #2"]
[]
[{"$f":"P120","v":"None"},null,{"$f":"P120","v":"None"},null,{"$f":"P120","v":"None"},null,{"$f":"P120","v":"None"},null,null,{"$f":"P120","v":"None"},null,{"$f":"P120","v":"None"}]
[{"$f":"P131","v":"4.a. Grass Channel A/B Soils"},null,{"$f":"P131","v":"4.a. Grass Channel A/B Soils"},null,{"$f":"P131","v":"4.a. Grass Channel A/B Soils"},null,{"$f":"P131","v":"4.a. Grass Channel A/B Soils"},null,null,{"$f":"P131","v":"4.a. Grass Channel A/B Soils"},null,{"$f":"P131","v":"4.a. Grass Channel A/B Soils"}]
[{"$f":"P132","v":"4.b. Grass Channel C/D Soils"},null,{"$f":"P132","v":"4.b. Grass Channel C/D Soils"},null,{"$f":"P132","v":"4.b. Grass Channel C/D Soils"},null,"4.b. Grass Channel C/D Soils",null,null,"4.b. Grass Channel C/D Soils",null,"4.b. Grass Channel C/D Soils"]
[{"$f":"P133","v":"4.c. Grass Channel Compost Amended Soils"},null,{"$f":"P133","v":"4.c. Grass Channel Compost Amended Soils"},null,{"$f":"P133","v":"4.c. Grass Channel Compost Amended Soils"},null,"4.c. Grass Channel Compost Amended Soils",null,null,"4.c. Grass Channel Compost Amended Soils",null,"4.c. Grass Channel Compost Amended Soils"]
[{"$f":"P135","v":"5.b. Dry Swale #2"},null,{"$f":"P134","v":"5.a. Dry Swale #1"},null,{"$f":"P134","v":"5.a. Dry Swale #1"},null,"5.a. Dry Swale #1",null,null,"5.a. Dry Swale #1",null,"5.a. Dry Swale #1"]
["6.a. Bioretention #1",null,{"$f":"P136","v":"6.a. Bioretention #1"},null,{"$f":"P135","v":"5.b. Dry Swale #2"},null,"5.b. Dry Swale #2",null,null,"5.b. Dry Swale #2",null,"5.b. Dry Swale #2"]
["6.b. Bioretention #2",null,"6.b. Bioretention #2",null,{"$f":"P137","v":"6.b. Bioretention #2"},null,"6.a. Bioretention #1",null,null,"6.a. Bioretention #1",null,"6.a. Bioretention #1"]
["7.a. Infiltration #1",null,"7.a. Infiltration #1",null,"7.a. Infiltration #1",null,{"$f":"P138","v":"7.a. Infiltration #1"},null,null,"6.b. Bioretention #2",null,"6.b. Bioretention #2"]
["7.b. Infiltration #2",null,"7.b. Infiltration #2",null,"7.b. Infiltration #2",null,"7.b. Infiltration #2",null,null,{"$f":"P139","v":"7.b. Infiltration #2"},null,"7.a. Infiltration #1"]
["8.a. ED #1",null,"8.a. ED #1",null,"8.a. ED #1",null,"8.a. ED #1",null,null,"8.a. ED #1",null,{"$f":"P140","v":"8.a. ED #1"}]
["8.b. ED #2",null,"8.b. ED #2",null,"8.b. ED #2",null,"8.b. ED #2",null,null,"8.b. ED #2",null,"8.b. ED #2"]
["9.a. Sheetflow to A/B Soil Conservation Area ",null,"9.a. Sheetflow to A/B Soil Conservation Area ",null,"9.a. Sheetflow to A/B Soil Conservation Area ",null,"9.a. Sheetflow to A/B Soil Conservation Area ",null,null,"9.a. Sheetflow to A/B Soil Conservation Area ",null,"9.a. Sheetflow to A/B Soil Conservation Area "]
["9.b. Sheetflow to C/D Soil Conservation Area",null,"9.b. Sheetflow to C/D Soil Conservation Area",null,"9.b. Sheetflow to C/D Soil Conservation Area",null,"9.b. Sheetflow to C/D Soil Conservation Area",null,null,"9.b. Sheetflow to C/D Soil Conservation Area",null,"9.b. Sheetflow to C/D Soil Conservation Area"]
["9.c. Sheetflow to Vegetated Filter Strip",null,"9.c. Sheetflow to Vegetated Filter Strip",null,"9.c. Sheetflow to Vegetated Filter Strip",null,"9.c. Sheetflow to Vegetated Filter Strip",null,null,"9.c. Sheetflow to Vegetated Filter Strip",null,"9.c. Sheetflow to Vegetated Filter Strip"]
["10.a. Wet Swale #1",null,"10.a. Wet Swale #1",null,"10.a. Wet Swale #1",null,"10.a. Wet Swale #1",null,null,"10.a. Wet Swale #1",null,"10.a. Wet Swale #1"]
["10.b. Wet Swale #2",null,"10.b. Wet Swale #2",null,"10.b. Wet Swale #2",null,"10.b. Wet Swale #2",null,null,"10.b. Wet Swale #2",null,"10.b. Wet Swale #2"]
["11.a. Filtering Practice #1",null,"11.a. Filtering Practice #1",null,"11.a. Filtering Practice #1",null,"11.a. Filtering Practice #1",null,null,"11.a. Filtering Practice #1",null,"11.a. Filtering Practice #1"]
["11.b. Filtering Practice #2",null,"11.b. Filtering Practice #2",null,"11.b. Filtering Practice #2",null,"11.b. Filtering Practice #2",null,null,"11.b. Filtering Practice #2",null,"11.b. Filtering Practice #2"]
["12.a. Constructed Wetland #1",null,"12.a. Constructed Wetland #1",null,"12.a. Constructed Wetland #1",null,"12.a. Constructed Wetland #1",null,null,"12.a. Constructed Wetland #1",null,"12.a. Constructed Wetland #1"]
["12.b. Constructed Wetland #2",null,"12.b. Constructed Wetland #2",null,"12.b. Constructed Wetland #2",null,"12.b. Constructed Wetland #2",null,null,"12.b. Constructed Wetland #2",null,"12.b. Constructed Wetland #2"]
["13.a. Wet Pond #1",null,"13.a. Wet Pond #1",null,"13.a. Wet Pond #1",null,"13.a. Wet Pond #1",null,null,"13.a. Wet Pond #1",null,"13.a. Wet Pond #1"]
["13.b. Wet Pond #1 (Coastal Plain)",null,"13.b. Wet Pond #1 (Coastal Plain)",null,"13.b. Wet Pond #1 (Coastal Plain)",null,"13.b. Wet Pond #1 (Coastal Plain)",null,null,"13.b. Wet Pond #1 (Coastal Plain)",null,"13.b. Wet Pond #1 (Coastal Plain)"]
["13.c. Wet Pond #2",null,"13.c. Wet Pond #2",null,"13.c. Wet Pond #2",null,"13.c. Wet Pond #2",null,null,"13.c. Wet Pond #2",null,"13.c. Wet Pond #2"]
["13.d. Wet Pond #2 (Coastal Plain)",null,"13.d. Wet Pond #2 (Coastal Plain)",null,"13.d. Wet Pond #2 (Coastal Plain)",null,"13.d. Wet Pond #2 (Coastal Plain)",null,null,"13.d. Wet Pond #2 (Coastal Plain)",null,"13.d. Wet Pond #2 (Coastal Plain)"]
["14.a. MTD - Hydrodynamic",null,"14.a. MTD - Hydrodynamic",null,"14.a. MTD - Hydrodynamic",null,"14.a. MTD - Hydrodynamic",null,null,"14.a. MTD - Hydrodynamic",null,"14.a. MTD - Hydrodynamic"]
["14.b. MTD - Filtering",null,"14.b. MTD - Filtering",null,"14.b. MTD - Filtering",null,"14.b. MTD - Filtering",null,null,"14.b. MTD - Filtering",null,"14.b. MTD - Filtering"]
["14.c. MTD - Generic",null,"14.c. MTD - Generic",null,"14.c. MTD - Generic",null,"14.c. MTD - Generic",null,null,"14.c. MTD - Generic",null,"14.c. MTD - Generic"]
[]
["Options for 8a. Extended Detention #1",null,"Options for 8b. Extended Detention #2",null,"Options for 9 Sheet Flow to Open Space",null,"Options for 9c. Sheet Flow to Filter Strip",null,null,"Options for 10a. Wet Swale #1",null,"Options for 10b. Wet Swale #2"]
[]
[{"$f":"P120","v":"None"},null,{"$f":"P120","v":"None"},null,{"$f":"P120","v":"None"},null,{"$f":"P120","v":"None"},null,null,{"$f":"P120","v":"None"},null,{"$f":"P120","v":"None"}]
[{"$f":"P131","v":"4.a. Grass Channel A/B Soils"},null,{"$f":"P131","v":"4.a. Grass Channel A/B Soils"},null,null,null,{"$f":"P131","v":"4.a. Grass Channel A/B Soils"},null,null,{"$f":"P131","v":"4.a. Grass Channel A/B Soils"},null,{"$f":"P131","v":"4.a. Grass Channel A/B Soils"}]
["4.b. Grass Channel C/D Soils",null,"4.b. Grass Channel C/D Soils",null,null,null,"4.b. Grass Channel C/D Soils",null,null,"4.b. Grass Channel C/D Soils",null,"4.b. Grass Channel C/D Soils"]
["4.c. Grass Channel Compost Amended Soils",null,"4.c. Grass Channel Compost Amended Soils",null,null,null,"4.c. Grass Channel Compost Amended Soils",null,null,"4.c. Grass Channel Compost Amended Soils",null,"4.c. Grass Channel Compost Amended Soils"]
["5.a. Dry Swale #1",null,"5.a. Dry Swale #1",null,null,null,"5.a. Dry Swale #1",null,null,"5.a. Dry Swale #1",null,"5.a. Dry Swale #1"]
["5.b. Dry Swale #2",null,"5.b. Dry Swale #2",null,null,null,"5.b. Dry Swale #2",null,null,"5.b. Dry Swale #2",null,"5.b. Dry Swale #2"]
["6.a. Bioretention #1",null,"6.a. Bioretention #1",null,null,null,"6.a. Bioretention #1",null,null,"6.a. Bioretention #1",null,"6.a. Bioretention #1"]
["6.b. Bioretention #2",null,"6.b. Bioretention #2",null,null,null,"6.b. Bioretention #2",null,null,"6.b. Bioretention #2",null,"6.b. Bioretention #2"]
["7.a. Infiltration #1",null,"7.a. Infiltration #1",null,null,null,"7.a. Infiltration #1",null,null,"7.a. Infiltration #1",null,"7.a. Infiltration #1"]
["7.b. Infiltration #2",null,"7.b. Infiltration #2",null,null,null,"7.b. Infiltration #2",null,null,"7.b. Infiltration #2",null,"7.b. Infiltration #2"]
[{"$f":"P141","v":"8.b. ED #2"},null,"8.a. ED #1",null,null,null,"8.a. ED #1",null,null,"8.a. ED #1",null,"8.a. ED #1"]
["9.a. Sheetflow to A/B Soil Conservation Area ",null,{"$f":"P142","v":"9.a. Sheetflow to A/B Soil Conservation Area "},null,null,null,"8.b. ED #2",null,null,"8.b. ED #2",null,"8.b. ED #2"]
["9.b. Sheetflow to C/D Soil Conservation Area",null,"9.b. Sheetflow to C/D Soil Conservation Area",null,null,null,"9.a. Sheetflow to A/B Soil Conservation Area ",null,null,"9.a. Sheetflow to A/B Soil Conservation Area ",null,"9.a. Sheetflow to A/B Soil Conservation Area "]
["9.c. Sheetflow to Vegetated Filter Strip",null,"9.c. Sheetflow to Vegetated Filter Strip",null,null,null,"9.b. Sheetflow to C/D Soil Conservation Area",null,null,"9.b. Sheetflow to C/D Soil Conservation Area",null,"9.b. Sheetflow to C/D Soil Conservation Area"]
["10.a. Wet Swale #1",null,"10.a. Wet Swale #1",null,null,null,{"$f":"P145","v":"10.a. Wet Swale #1"},null,null,"9.c. Sheetflow to Vegetated Filter Strip",null,"9.c. Sheetflow to Vegetated Filter Strip"]
["10.b. Wet Swale #2",null,"10.b. Wet Swale #2",null,null,null,"10.b. Wet Swale #2",null,null,{"$f":"P146","v":"10.b. Wet Swale #2"},null,"10.a. Wet Swale #1"]
["11.a. Filtering Practice #1",null,"11.a. Filtering Practice #1",null,null,null,"11.a. Filtering Practice #1",null,null,"11.a. Filtering Practice #1",null,{"$f":"P147","v":"11.a. Filtering Practice #1"}]
["11.b. Filtering Practice #2",null,"11.b. Filtering Practice #2",null,null,null,"11.b. Filtering Practice #2",null,null,"11.b. Filtering Practice #2",null,"11.b. Filtering Practice #2"]
["12.a. Constructed Wetland #1",null,"12.a. Constructed Wetland #1",null,null,null,"12.a. Constructed Wetland #1",null,null,"12.a. Constructed Wetland #1",null,"12.a. Constructed Wetland #1"]
["12.b. Constructed Wetland #2",null,"12.b. Constructed Wetland #2",null,null,null,"12.b. Constructed Wetland #2",null,null,"12.b. Constructed Wetland #2",null,"12.b. Constructed Wetland #2"]
["13.a. Wet Pond #1",null,"13.a. Wet Pond #1",null,null,null,"13.a. Wet Pond #1",null,null,"13.a. Wet Pond #1",null,"13.a. Wet Pond #1"]
["13.b. Wet Pond #1 (Coastal Plain)",null,"13.b. Wet Pond #1 (Coastal Plain)",null,null,null,"13.b. Wet Pond #1 (Coastal Plain)",null,null,"13.b. Wet Pond #1 (Coastal Plain)",null,"13.b. Wet Pond #1 (Coastal Plain)"]
["13.c. Wet Pond #2",null,"13.c. Wet Pond #2",null,null,null,"13.c. Wet Pond #2",null,null,"13.c. Wet Pond #2",null,"13.c. Wet Pond #2"]
["13.d. Wet Pond #2 (Coastal Plain)",null,"13.d. Wet Pond #2 (Coastal Plain)",null,null,null,"13.d. Wet Pond #2 (Coastal Plain)",null,null,"13.d. Wet Pond #2 (Coastal Plain)",null,"13.d. Wet Pond #2 (Coastal Plain)"]
["14.a. MTD - Hydrodynamic",null,"14.a. MTD - Hydrodynamic",null,null,null,"14.a. MTD - Hydrodynamic",null,null,"14.a. MTD - Hydrodynamic",null,"14.a. MTD - Hydrodynamic"]
["14.b. MTD - Filtering",null,"14.b. MTD - Filtering",null,null,null,"14.b. MTD - Filtering",null,null,"14.b. MTD - Filtering",null,"14.b. MTD - Filtering"]
["14.c. MTD - Generic",null,"14.c. MTD - Generic",null,null,null,"14.c. MTD - Generic",null,null,"14.c. MTD - Generic",null,"14.c. MTD - Generic"]
[]
[null,null,null,null,"Options for 12.a.  Constructed Wetland #1",null,"Options for 12.b.  Constructed Wetland #2"]
["Options for 11 A.  Filtering Practice #1",null,"Options for 11 b.  Filtering Practice #2",null,null,null,null,null,null,"Options for 13.a.  Wet Pond #1"]
[null,null,null,null,{"$f":"P120","v":"None"},null,{"$f":"P120","v":"None"},null,null,{"$f":"P120","v":"None"},null,"Options for 13.b.  Wet Pond #1 (Coastal Plain)"]
[{"$f":"P120","v":"None"},null,{"$f":"P120","v":"None"},null,{"$f":"P131","v":"4.a. Grass Channel A/B Soils"},null,{"$f":"P131","v":"4.a. Grass Channel A/B Soils"},null,null,{"$f":"P131","v":"4.a. Grass Channel A/B Soils"},null,{"$f":"P120","v":"None"}]
[{"$f":"P131","v":"4.a. Grass Channel A/B Soils"},null,{"$f":"P131","v":"4.a. Grass Channel A/B Soils"},null,"4.b. Grass Channel C/D Soils",null,"4.b. Grass Channel C/D Soils",null,null,"4.b. Grass Channel C/D Soils",null,{"$f":"P131","v":"4.a. Grass Channel A/B Soils"}]
["4.b. Grass Channel C/D Soils",null,"4.b. Grass Channel C/D Soils",null,"4.c. Grass Channel Compost Amended Soils",null,"4.c. Grass Channel Compost Amended Soils",null,null,"4.c. Grass Channel Compost Amended Soils",null,"4.b. Grass Channel C/D Soils"]
["4.c. Grass Channel Compost Amended Soils",null,"4.c. Grass Channel Compost Amended Soils",null,"5.a. Dry Swale #1",null,"5.a. Dry Swale #1",null,null,"5.a. Dry Swale #1",null,"4.c. Grass Channel Compost Amended Soils"]
["5.a. Dry Swale #1",null,"5.a. Dry Swale #1",null,"5.b. Dry Swale #2",null,"5.b. Dry Swale #2",null,null,"5.b. Dry Swale #2",null,"5.a. Dry Swale #1"]
["5.b. Dry Swale #2",null,"5.b. Dry Swale #2",null,"6.a. Bioretention #1",null,"6.a. Bioretention #1",null,null,"6.a. Bioretention #1",null,"5.b. Dry Swale #2"]
["6.a. Bioretention #1",null,"6.a. Bioretention #1",null,"6.b. Bioretention #2",null,"6.b. Bioretention #2",null,null,"6.b. Bioretention #2",null,"6.a. Bioretention #1"]
["6.b. Bioretention #2",null,"6.b. Bioretention #2",null,"7.a. Infiltration #1",null,"7.a. Infiltration #1",null,null,"7.a. Infiltration #1",null,"6.b. Bioretention #2"]
["7.a. Infiltration #1",null,"7.a. Infiltration #1",null,"7.b. Infiltration #2",null,"7.b. Infiltration #2",null,null,"7.b. Infiltration #2",null,"7.a. Infiltration #1"]
["7.b. Infiltration #2",null,"7.b. Infiltration #2",null,"8.a. ED #1",null,"8.a. ED #1",null,null,"8.a. ED #1",null,"7.b. Infiltration #2"]
["8.a. ED #1",null,"8.a. ED #1",null,"8.b. ED #2",null,"8.b. ED #2",null,null,"8.b. ED #2",null,"8.a. ED #1"]
["8.b. ED #2",null,"8.b. ED #2",null,"9.a. Sheetflow to A/B Soil Conservation Area ",null,"9.a. Sheetflow to A/B Soil Conservation Area ",null,null,"9.a. Sheetflow to A/B Soil Conservation Area ",null,"8.b. ED #2"]
["9.a. Sheetflow to A/B Soil Conservation Area ",null,"9.a. Sheetflow to A/B Soil Conservation Area ",null,"9.b. Sheetflow to C/D Soil Conservation Area",null,"9.b. Sheetflow to C/D Soil Conservation Area",null,null,"9.b. Sheetflow to C/D Soil Conservation Area",null,"9.a. Sheetflow to A/B Soil Conservation Area "]
["9.b. Sheetflow to C/D Soil Conservation Area",null,"9.b. Sheetflow to C/D Soil Conservation Area",null,"9.c. Sheetflow to Vegetated Filter Strip",null,"9.c. Sheetflow to Vegetated Filter Strip",null,null,"9.c. Sheetflow to Vegetated Filter Strip",null,"9.b. Sheetflow to C/D Soil Conservation Area"]
["9.c. Sheetflow to Vegetated Filter Strip",null,"9.c. Sheetflow to Vegetated Filter Strip",null,"10.a. Wet Swale #1",null,"10.a. Wet Swale #1",null,null,"10.a. Wet Swale #1",null,"9.c. Sheetflow to Vegetated Filter Strip"]
["10.a. Wet Swale #1",null,"10.a. Wet Swale #1",null,"10.b. Wet Swale #2",null,"10.b. Wet Swale #2",null,null,"10.b. Wet Swale #2",null,"10.a. Wet Swale #1"]
["10.b. Wet Swale #2",null,"10.b. Wet Swale #2",null,"11.a. Filtering Practice #1",null,"11.a. Filtering Practice #1",null,null,"11.a. Filtering Practice #1",null,"10.b. Wet Swale #2"]
[{"$f":"P148","v":"11.b. Filtering Practice #2"},null,"11.a. Filtering Practice #1",null,"11.b. Filtering Practice #2",null,"11.b. Filtering Practice #2",null,null,"11.b. Filtering Practice #2",null,"11.a. Filtering Practice #1"]
["12.a. Constructed Wetland #1",null,{"$f":"P149","v":"12.a. Constructed Wetland #1"},null,{"$f":"P150","v":"12.b. Constructed Wetland #2"},null,"12.a. Constructed Wetland #1",null,null,"12.a. Constructed Wetland #1",null,"11.b. Filtering Practice #2"]
["12.b. Constructed Wetland #2",null,"12.b. Constructed Wetland #2",null,"13.a. Wet Pond #1",null,{"$f":"P151","v":"13.a. Wet Pond #1"},null,null,"12.b. Constructed Wetland #2",null,"12.a. Constructed Wetland #1"]
["13.a. Wet Pond #1",null,"13.a. Wet Pond #1",null,"13.b. Wet Pond #1 (Coastal Plain)",null,"13.b. Wet Pond #1 (Coastal Plain)",null,null,{"$f":"P153","v":"13.c. Wet Pond #2"},null,"12.b. Constructed Wetland #2"]
["13.b. Wet Pond #1 (Coastal Plain)",null,"13.b. Wet Pond #1 (Coastal Plain)",null,"13.c. Wet Pond #2",null,"13.c. Wet Pond #2",null,null,{"$f":"P155","v":"14.a. MTD - Hydrodynamic"},null,{"$f":"P154","v":"13.d. Wet Pond #2 (Coastal Plain)"}]
["13.c. Wet Pond #2",null,"13.c. Wet Pond #2",null,"13.d. Wet Pond #2 (Coastal Plain)",null,"13.d. Wet Pond #2 (Coastal Plain)",null,null,{"$f":"P156","v":"14.b. MTD - Filtering"},null,{"$f":"P155","v":"14.a. MTD - Hydrodynamic"}]
["13.d. Wet Pond #2 (Coastal Plain)",null,"13.d. Wet Pond #2 (Coastal Plain)",null,"14.a. MTD - Hydrodynamic",null,"14.a. MTD - Hydrodynamic",null,null,{"$f":"P157","v":"14.c. MTD - Generic"},null,{"$f":"P156","v":"14.b. MTD - Filtering"}]
["14.a. MTD - Hydrodynamic",null,"14.a. MTD - Hydrodynamic",null,"14.b. MTD - Filtering",null,"14.b. MTD - Filtering",null,null,null,null,{"$f":"P157","v":"14.c. MTD - Generic"}]
["14.b. MTD - Filtering",null,"14.b. MTD - Filtering",null,"14.c. MTD - Generic",null,"14.c. MTD - Generic"]
["14.c. MTD - Generic",null,"14.c. MTD - Generic"]
[]
[]
["Options for 13.c.  Wet Pond #2",null,"Options for 13.d.  Wet Pond #2 (Coastal Plain)",null,"Options for 14.a.  Manufactured Device-Hydrodynamic",null,"Options for 14.b.  Manufactured Device-Filtering",null,null,null,"Options for 14.c.  Manufactured Device-Generic"]
[]
[{"$f":"P120","v":"None"},null,{"$f":"P120","v":"None"},null,{"$f":"P120","v":"None"},null,{"$f":"P120","v":"None"},null,null,null,{"$f":"P120","v":"None"}]
[{"$f":"P131","v":"4.a. Grass Channel A/B Soils"},null,{"$f":"P131","v":"4.a. Grass Channel A/B Soils"},null,{"$f":"P131","v":"4.a. Grass Channel A/B Soils"},null,{"$f":"P131","v":"4.a. Grass Channel A/B Soils"},null,null,null,{"$f":"P131","v":"4.a. Grass Channel A/B Soils"}]
["4.b. Grass Channel C/D Soils",null,"4.b. Grass Channel C/D Soils",null,"4.b. Grass Channel C/D Soils",null,"4.b. Grass Channel C/D Soils",null,null,null,"4.b. Grass Channel C/D Soils"]
["4.c. Grass Channel Compost Amended Soils",null,"4.c. Grass Channel Compost Amended Soils",null,"4.c. Grass Channel Compost Amended Soils",null,"4.c. Grass Channel Compost Amended Soils",null,null,null,"4.c. Grass Channel Compost Amended Soils"]
["5.a. Dry Swale #1",null,"5.a. Dry Swale #1",null,"5.a. Dry Swale #1",null,"5.a. Dry Swale #1",null,null,null,"5.a. Dry Swale #1"]
["5.b. Dry Swale #2",null,"5.b. Dry Swale #2",null,"5.b. Dry Swale #2",null,"5.b. Dry Swale #2",null,null,null,"5.b. Dry Swale #2"]
["6.a. Bioretention #1",null,"6.a. Bioretention #1",null,"6.a. Bioretention #1",null,"6.a. Bioretention #1",null,null,null,"6.a. Bioretention #1"]
["6.b. Bioretention #2",null,"6.b. Bioretention #2",null,"6.b. Bioretention #2",null,"6.b. Bioretention #2",null,null,null,"6.b. Bioretention #2"]
["7.a. Infiltration #1",null,"7.a. Infiltration #1",null,"7.a. Infiltration #1",null,"7.a. Infiltration #1",null,null,null,"7.a. Infiltration #1"]
["7.b. Infiltration #2",null,"7.b. Infiltration #2",null,"7.b. Infiltration #2",null,"7.b. Infiltration #2",null,null,null,"7.b. Infiltration #2"]
["8.a. ED #1",null,"8.a. ED #1",null,"8.a. ED #1",null,"8.a. ED #1",null,null,null,"8.a. ED #1"]
["8.b. ED #2",null,"8.b. ED #2",null,"8.b. ED #2",null,"8.b. ED #2",null,null,null,"8.b. ED #2"]
["9.a. Sheetflow to A/B Soil Conservation Area ",null,"9.a. Sheetflow to A/B Soil Conservation Area ",null,"9.a. Sheetflow to A/B Soil Conservation Area ",null,"9.a. Sheetflow to A/B Soil Conservation Area ",null,null,null,"9.a. Sheetflow to A/B Soil Conservation Area "]
["9.b. Sheetflow to C/D Soil Conservation Area",null,"9.b. Sheetflow to C/D Soil Conservation Area",null,"9.b. Sheetflow to C/D Soil Conservation Area",null,"9.b. Sheetflow to C/D Soil Conservation Area",null,null,null,"9.b. Sheetflow to C/D Soil Conservation Area"]
["9.c. Sheetflow to Vegetated Filter Strip",null,"9.c. Sheetflow to Vegetated Filter Strip",null,"9.c. Sheetflow to Vegetated Filter Strip",null,"9.c. Sheetflow to Vegetated Filter Strip",null,null,null,"9.c. Sheetflow to Vegetated Filter Strip"]
["10.a. Wet Swale #1",null,"10.a. Wet Swale #1",null,"10.a. Wet Swale #1",null,"10.a. Wet Swale #1",null,null,null,"10.a. Wet Swale #1"]
["10.b. Wet Swale #2",null,"10.b. Wet Swale #2",null,"10.b. Wet Swale #2",null,"10.b. Wet Swale #2",null,null,null,"10.b. Wet Swale #2"]
["11.a. Filtering Practice #1",null,"11.a. Filtering Practice #1",null,"11.a. Filtering Practice #1",null,"11.a. Filtering Practice #1",null,null,null,"11.a. Filtering Practice #1"]
["11.b. Filtering Practice #2",null,"11.b. Filtering Practice #2",null,"11.b. Filtering Practice #2",null,"11.b. Filtering Practice #2",null,null,null,"11.b. Filtering Practice #2"]
["12.a. Constructed Wetland #1",null,"12.a. Constructed Wetland #1",null,"12.a. Constructed Wetland #1",null,"12.a. Constructed Wetland #1",null,null,null,"12.a. Constructed Wetland #1"]
["12.b. Constructed Wetland #2",null,"12.b. Constructed Wetland #2",null,"12.b. Constructed Wetland #2",null,"12.b. Constructed Wetland #2",null,null,null,"12.b. Constructed Wetland #2"]
["13.a. Wet Pond #1",null,{"$f":"P152","v":"13.b. Wet Pond #1 (Coastal Plain)"},null,"13.a. Wet Pond #1",null,"13.a. Wet Pond #1",null,null,null,"13.a. Wet Pond #1"]
[{"$f":"P155","v":"14.a. MTD - Hydrodynamic"},null,{"$f":"P155","v":"14.a. MTD - Hydrodynamic"},null,"13.b. Wet Pond #1 (Coastal Plain)",null,"13.b. Wet Pond #1 (Coastal Plain)",null,null,null,"13.b. Wet Pond #1 (Coastal Plain)"]
[{"$f":"P156","v":"14.b. MTD - Filtering"},null,{"$f":"P156","v":"14.b. MTD - Filtering"},null,"13.c. Wet Pond #2",null,"13.c. Wet Pond #2",null,null,null,"13.c. Wet Pond #2"]
[{"$f":"P157","v":"14.c. MTD - Generic"},null,{"$f":"P157","v":"14.c. MTD - Generic"},null,"13.d. Wet Pond #2 (Coastal Plain)",null,"13.d. Wet Pond #2 (Coastal Plain)",null,null,null,"13.d. Wet Pond #2 (Coastal Plain)"]
[null,null,null,null,{"$f":"P156","v":"14.b. MTD - Filtering"}]

{"sheet":"D.A. C","index":3,"n_rows":278,"n_cols":27,"rows_kept":278,"cut":false,"hidden":false,"merged":[[13,13,13,14],[0,3,0,4],[6,8,6,11],[7,8,7,11],[10,13,10,14],[12,13,12,14],[31,13,31,14],[16,13,16,14],[17,13,17,14],[18,13,18,14],[19,13,19,14],[20,13,20,14],[21,13,21,14],[22,13,22,14],[23,13,23,14],[24,13,24,14],[27,13,27,14],[28,13,28,14],[54,13,54,14],[51,16,51,19],[52,13,52,14],[32,13,32,14],[33,13,33,14],[36,13,36,14],[37,13,37,14],[40,13,40,14],[41,13,41,14],[44,13,44,14],[45,13,45,14],[48,13,48,14],[49,13,49,14],[53,13,53,14],[69,1,69,2],[69,15,69,16],[70,17,70,19],[88,0,88,1],[88,17,88,19],[72,13,72,14],[74,16,74,18],[75,13,75,14],[76,13,76,14],[79,13,79,14],[80,13,80,14],[71,13,71,14],[89,13,89,14],[90,13,90,14],[91,13,91,14],[82,16,82,17],[83,13,83,14],[84,13,84,14],[85,13,85,14],[86,13,86,14]]}
["Drainage Area C"]
[null,null,null,null,null,null,null,null,null,null,null,null,null,null,null,null,null,null,null,null,null,null,null,null,"Check Areas!",null,"CHECK AREAS!"]
["Drainage Area A Land Cover  (acres)",{"$f":"IF($F$8>Site!$F$27,\"Drainage area is greater than site area!\",(IF(OR(F5>Site!F24,F6>Site!F25,F7>Site!F26),\"Check Site Tab land cover areas!\",\"\")))","v":""}]
[null,"A Soils","B Soils","C Soils","D Soils","Totals","Land Cover Rv",null,null,null,null,null,null,"`"]
["Forest/Open Space (acres)",null,null,null,null,{"$f":"SUMIF(B5:E5,\">=0\")","v":0},{"$f":"IF(F5>0,(B5*Site!E32+C5*Site!F32+D5*Site!G32+E5*Site!H32)/F5,0)","v":0}]
["Managed Turf (acres)",null,null,null,null,{"$f":"SUMIF(B6:E6,\">=0\")","v":0},{"$f":"IF(F6>0,(B6*Site!E33+C6*Site!F33+D6*Site!G33+E6*Site!H33)/F6,0)","v":0}]
["Impervious Cover (acres) ",null,null,null,null,{"$f":"SUMIF(B7:E7,\">=0\")","v":0},{"$f":"IF(F7>0,((B7*Site!E34+C7*Site!F34+D7*Site!G34+E7*Site!H34)/F7),0)","v":0},null,"     Total Phosphorus Available for Removal in D.A. C (lb/yr)",null,null,null,{"$f":"Site!$B$31*Site!$B$36*($M$8/Site!$B$32)*Site!$B$33*2.72/43560","v":0}]
[null,null,null,null,"Total",{"$f":"SUM(F5:F7)","v":0},null,null,"Post Development Treatment Volume in D.A. C (ft3)",null,null,null,{"$f":"IFERROR(Site!B32/12*(F6*G6+F7*G7)/(F6+F7)*(F6+F7)*43560,0)","v":0}]
[]
["Stormwater Best Management Practices (RR = Runoff Reduction)",null,null,null,null,null,null,null,null,null,null,null,null,"--Select from dropdown lists--"]
["Practice","Runoff Reduction Credit (%)","Managed Turf Credit Area (acres) ","Impervious Cover Credit Area (acres)","Volume from Upstream Practice (ft3)","Runoff Reduction (ft3)","Remaining Runoff Volume  (ft3)","Total BMP Treatment Volume (ft3)","Phosphorus Removal Efficiency (%)","Phosphorus Load from Upstream Practices (lb)","Untreated Phosphorus Load to Practice (lb)","Phosphorus Removed By Practice (lb)","Remaining Phosphorus Load (lb)","Downstream Practice to be Employed",null,null,"Nitrogen Removal Efficiency (%)","Nitrogen Load from Upstream  Practices (lbs)","Untreated Nitrogen Load to Practice (lbs)","Nitrogen Removed By Practice (lbs)","Remaining Nitrogen Load (lbs)"]
["1. Vegetated Roof (RR)",null,null,null,null,null,null,null,null,null,null,null,null,null,null,null,"1. Vegetated Roof (RR)"]
["1.a. Vegetated Roof #1 (Spec #5)",45,null,null,null,{"$f":"(Site!$B$32*($G$7*$D13)*3630)*$B13/100","v":0},{"$f":"(Site!$B$32*($G$7*$D13)*3630)*(1-$B13/100)","v":0},{"$f":"+$F13+$G13","v":0},0,null,{"$f":"(Site!$B$32*($G$7*$D13)*3630)*Site!$B$33*0.3048^3/454*Site!$B$31/Site!$B$32*Site!$B$36","v":0},{"$f":"IFERROR($K13*($F13+$G13*$I13/100)/($H13),0)","v":0},{"$f":"$K13-$L13","v":0},null,null,null,0,null,{"$f":"(Site!$B$32*$G$7*$D13*3630)*Site!$B$34*0.3048^3/454*Site!$B$31/Site!$B$32*Site!$B$36","v":0},{"$f":"IFERROR($S13*($F13+$G13*$Q13/100)/$H13,0)","v":0},{"$f":"$S13-$T13","v":0}]
["1.b. Vegetated Roof #2 (Spec #5)",60,null,null,null,{"$f":"(Site!$B$32*($G$7*$D14)*3630)*$B14/100","v":0},{"$f":"(Site!$B$32*($G$7*$D14)*3630)*(1-$B14/100)","v":0},{"$f":"+$F14+$G14","v":0},0,null,{"$f":"(Site!$B$32*($G$7*$D14)*3630)*Site!$B$33*0.3048^3/454*Site!$B$31/Site!$B$32*Site!$B$36","v":0},{"$f":"IFERROR($K14*($F14+$G14*$I14/100)/($H14),0)","v":0},{"$f":"$K14-$L14","v":0},null,null,null,0,null,{"$f":"(Site!$B$32*$G$7*$D14*3630)*Site!$B$34*0.3048^3/454*Site!$B$31/Site!$B$32*Site!$B$36","v":0},{"$f":"IFERROR($S14*($F14+$G14*$Q14/100)/$H14,0)","v":0},{"$f":"$S14-$T14","v":0}]
[]
["2. Rooftop Disconnection (RR)",null,null,null,null,null,null,null,null,null,null,null,null,null,null,null,"2. Rooftop Disconnection (RR)"]
["2.a. Simple Disconnection to A/B Soils \n(Spec #1)",50,null,null,{"$f":"SUMIF($N$13:$N$92,$P121,$G$13:$G$92)","v":0},{"$f":"(Site!$B$32*($G$6*$C17+$G$7*$D17)*3630+$E17)*$B17/100","v":0},{"$f":"(Site!$B$32*($G$6*$C17+$G$7*$D17)*3630+$E17)*(1-$B17/100)","v":0},{"$f":"+$F17+$G17","v":0},0,{"$f":"SUMIF($N$13:$N$92,$P121,$M$13:$M$92)","v":0},{"$f":"(Site!$B$32*($G$6*$C17+$G$7*$D17)*3630)*Site!$B$33*0.3048^3/454*Site!$B$31/Site!$B$32*Site!$B$36","v":0},{"$f":"IFERROR(($J17+$K17)*($F17+$G17*$I17/100)/$H17,0)","v":0},{"$f":"$J17+$K17-$L17","v":0},null,null,null,0,{"$f":"SUMIF($N$13:$N$92,$P121,$U$13:$U$92)","v":0},{"$f":"(Site!$B$32*$G$7*$D17*3630)*Site!$B$34*0.3048^3/454*Site!$B$31/Site!$B$32*Site!$B$36","v":0},{"$f":"IFERROR(($R17+$S17)*($F17+$G17*$Q17/100)/$H17,0)","v":0},{"$f":"$R17+$S17-$T17","v":0}]
["2.b. Simple Disconnection to C/D Soils \n(Spec #1)",25,null,null,{"$f":"SUMIF($N$13:$N$92,$P122,$G$13:$G$92)","v":0},{"$f":"(Site!$B$32*($G$6*$C18+$G$7*$D18)*3630+$E18)*$B18/100","v":0},{"$f":"(Site!$B$32*($G$6*$C18+$G$7*$D18)*3630+$E18)*(1-$B18/100)","v":0},{"$f":"+$F18+$G18","v":0},0,{"$f":"SUMIF($N$13:$N$92,$P122,$M$13:$M$92)","v":0},{"$f":"(Site!$B$32*($G$6*$C18+$G$7*$D18)*3630)*Site!$B$33*0.3048^3/454*Site!$B$31/Site!$B$32*Site!$B$36","v":0},{"$f":"IFERROR(($J18+$K18)*($F18+$G18*$I18/100)/$H18,0)","v":0},0,null,null,null,0,{"$f":"SUMIF($N$13:$N$92,$P122,$U$13:$U$92)","v":0},{"$f":"(Site!$B$32*$G$7*$D18*3630)*Site!$B$34*0.3048^3/454*Site!$B$31/Site!$B$32*Site!$B$36","v":0},{"$f":"IFERROR(($R18+$S18)*($F18+$G18*$Q18/100)/$H18,0)","v":0},0]
["2.c. To Soil Amended Filter Path as per specifications (existing C/D soils) (Spec #4)",50,null,null,0,{"$f":"(Site!$B$32*($G$6*$C19+$G$7*$D19)*3630+$E19)*$B19/100","v":0},{"$f":"(Site!$B$32*($G$6*$C19+$G$7*$D19)*3630+$E19)*(1-$B19/100)","v":0},0,0,0,{"$f":"(Site!$B$32*($G$6*$C19+$G$7*$D19)*3630)*Site!$B$33*0.3048^3/454*Site!$B$31/Site!$B$32*Site!$B$36","v":0},0,0,null,null,null,0,0,{"$f":"(Site!$B$32*$G$7*$D19*3630)*Site!$B$34*0.3048^3/454*Site!$B$31/Site!$B$32*Site!$B$36","v":0},0,0]
["2.d. To Dry Well or French Drain #1, \nMicro-Infilration #1 (Spec #8)",50,null,null,0,{"$f":"(Site!$B$32*($G$6*$C20+$G$7*$D20)*3630+$E20)*$B20/100","v":0},{"$f":"(Site!$B$32*($G$6*$C20+$G$7*$D20)*3630+$E20)*(1-$B20/100)","v":0},0,25,0,{"$f":"(Site!$B$32*($G$6*$C20+$G$7*$D20)*3630)*Site!$B$33*0.3048^3/454*Site!$B$31/Site!$B$32*Site!$B$36","v":0},0,0,null,null,null,15,0,{"$f":"(Site!$B$32*$G$7*$D20*3630)*Site!$B$34*0.3048^3/454*Site!$B$31/Site!$B$32*Site!$B$36","v":0},0,0]
["2.e. To Dry Well or French Drain #2, \nMicro-Infiltration #2 (Spec #8)",90,null,null,0,{"$f":"(Site!$B$32*($G$6*$C21+$G$7*$D21)*3630+$E21)*$B21/100","v":0},{"$f":"(Site!$B$32*($G$6*$C21+$G$7*$D21)*3630+$E21)*(1-$B21/100)","v":0},0,25,0,{"$f":"(Site!$B$32*($G$6*$C21+$G$7*$D21)*3630)*Site!$B$33*0.3048^3/454*Site!$B$31/Site!$B$32*Site!$B$36","v":0},0,0,null,null,null,15,0,{"$f":"(Site!$B$32*$G$7*$D21*3630)*Site!$B$34*0.3048^3/454*Site!$B$31/Site!$B$32*Site!$B$36","v":0},0,0]
["2.f. To Rain Garden #1, \nMicro-Bioretention #1 (Spec #9)",40,null,null,0,{"$f":"(Site!$B$32*($G$6*$C22+$G$7*$D22)*3630+$E22)*$B22/100","v":0},{"$f":"(Site!$B$32*($G$6*$C22+$G$7*$D22)*3630+$E22)*(1-$B22/100)","v":0},0,25,0,{"$f":"(Site!$B$32*($G$6*$C22+$G$7*$D22)*3630)*Site!$B$33*0.3048^3/454*Site!$B$31/Site!$B$32*Site!$B$36","v":0},0,0,null,null,null,40,0,{"$f":"(Site!$B$32*$G$7*$D22*3630)*Site!$B$34*0.3048^3/454*Site!$B$31/Site!$B$32*Site!$B$36","v":0},0,0]
["2.g. To Rain Garden #2, \nMicro-Bioretention #2 (Spec #9)",80,null,null,0,{"$f":"(Site!$B$32*($G$6*$C23+$G$7*$D23)*3630+$E23)*$B23/100","v":0},{"$f":"(Site!$B$32*($G$6*$C23+$G$7*$D23)*3630+$E23)*(1-$B23/100)","v":0},0,50,0,{"$f":"(Site!$B$32*($G$6*$C23+$G$7*$D23)*3630)*Site!$B$33*0.3048^3/454*Site!$B$31/Site!$B$32*Site!$B$36","v":0},0,0,null,null,null,60,0,{"$f":"(Site!$B$32*$G$7*$D23*3630)*Site!$B$34*0.3048^3/454*Site!$B$31/Site!$B$32*Site!$B$36","v":0},0,0]
["2.h. To Rainwater Harvesting (Spec #6)",0,null,null,0,{"$f":"(Site!$B$32*($G$6*$C24+$G$7*$D24)*3630+$E24)*$B24/100","v":0},{"$f":"(Site!$B$32*($G$6*$C24+$G$7*$D24)*3630+$E24)*(1-$B24/100)","v":0},0,0,0,{"$f":"(Site!$B$32*($G$6*$C24+$G$7*$D24)*3630)*Site!$B$33*0.3048^3/454*Site!$B$31/Site!$B$32*Site!$B$36","v":0},0,0,null,null,null,0,0,{"$f":"(Site!$B$32*$G$7*$D24*3630)*Site!$B$34*0.3048^3/454*Site!$B$31/Site!$B$32*Site!$B$36","v":0},0,0]
["2.i. To Stormwater Planter, \nUrban Bioretention (Spec #9, Appendix A)",40,null,null,0,{"$f":"(Site!$B$32*($G$6*$C25+$G$7*$D25)*3630+$E25)*$B25/100","v":0},{"$f":"(Site!$B$32*($G$6*$C25+$G$7*$D25)*3630+$E25)*(1-$B25/100)","v":0},0,25,0,{"$f":"(Site!$B$32*($G$6*$C25+$G$7*$D25)*3630)*Site!$B$33*0.3048^3/454*Site!$B$31/Site!$B$32*Site!$B$36","v":0},0,0,null,null,null,40,0,{"$f":"(Site!$B$32*$G$7*$D25*3630)*Site!$B$34*0.3048^3/454*Site!$B$31/Site!$B$32*Site!$B$36","v":0},0,0]
[]
["3. Permeable Pavement  (RR)",null,null,null,null,null,null,null,null,null,null,null,null,null,null,null,"3. Permeable Pavement  (RR)"]
["3.a. Permeable Pavement #1 (Spec #7)",45,null,null,{"$f":"SUMIF($N$13:$N$92,$P130,$G$13:$G$92)","v":0},{"$f":"(Site!$B$32*($G$6*$C28+$G$7*$D28)*3630+$E28)*$B28/100","v":0},{"$f":"(Site!$B$32*($G$6*$C28+$G$7*$D28)*3630+$E28)*(1-$B28/100)","v":0},{"$f":"+$F28+$G28","v":0},25,{"$f":"SUMIF($N$13:$N$92,$P130,$M$13:$M$92)","v":0},{"$f":"(Site!$B$32*($G$6*$C28+$G$7*$D28)*3630)*Site!$B$33*0.3048^3/454*Site!$B$31/Site!$B$32*Site!$B$36","v":0},{"$f":"IFERROR(($J28+$K28)*($F28+$G28*$I28/100)/$H28,0)","v":0},{"$f":"$J28+$K28-$L28","v":0},null,null,null,25,{"$f":"SUMIF($N$13:$N$92,$P130,$U$13:$U$92)","v":0},{"$f":"(Site!$B$32*($G$6*$C28+$G$7*$D28)*3630)*Site!$B$34*0.3048^3/454*Site!$B$31/Site!$B$32*Site!$B$36","v":0},{"$f":"IFERROR(($R28+$S28)*($F28+$G28*$Q28/100)/$H28,0)","v":0},{"$f":"$R28+$S28-$T28","v":0}]
["3.b. Permeable Pavement #2 (Spec #7)",75,null,null,null,{"$f":"(Site!$B$32*($G$6*$C29+$G$7*$D29)*3630+$E29)*$B29/100","v":0},{"$f":"(Site!$B$32*($G$6*$C29+$G$7*$D29)*3630+$E29)*(1-$B29/100)","v":0},{"$f":"+$F29+$G29","v":0},25,null,{"$f":"(Site!$B$32*($G$6*$C29+$G$7*$D29)*3630)*Site!$B$33*0.3048^3/454*Site!$B$31/Site!$B$32*Site!$B$36","v":0},{"$f":"IFERROR(($J29+$K29)*($F29+$G29*$I29/100)/$H29,0)","v":0},{"$f":"$K29-$L29","v":0},null,null,null,25,null,{"$f":"(Site!$B$32*$G$7*$D29*3630)*Site!$B$34*0.3048^3/454*Site!$B$31/Site!$B$32*Site!$B$36","v":0},{"$f":"IFERROR(($R29+$S29)*($F29+$G29*$Q29/100)/$H29,0)","v":0},{"$f":"$R29+$S29-$T29","v":0}]
[]
["4. Grass Channel (RR)",null,null,null,null,null,null,null,null,null,null,null,null,null,null,null,"4. Grass Channel (RR)"]
["4.a. Grass Channel A/B Soils (Spec #3)",20,null,null,{"$f":"SUMIF($N$13:$N$92,$P131,$G$13:$G$92)","v":0},{"$f":"(Site!$B$32*($G$6*$C32+$G$7*$D32)*3630+$E32)*$B32/100","v":0},{"$f":"(Site!$B$32*($G$6*$C32+$G$7*$D32)*3630+$E32)*(1-$B32/100)","v":0},{"$f":"+$F32+$G32","v":0},15,{"$f":"SUMIF($N$13:$N$92,$P131,$M$13:$M$92)","v":0},{"$f":"(Site!$B$32*($G$6*$C32+$G$7*$D32)*3630)*Site!$B$33*0.3048^3/454*Site!$B$31/Site!$B$32*Site!$B$36","v":0},{"$f":"IFERROR(($J32+$K32)*($F32+$G32*$I32/100)/$H32,0)","v":0},{"$f":"$J32+$K32-$L32","v":0},null,null,null,20,{"$f":"SUMIF($N$13:$N$92,$P131,$U$13:$U$92)","v":0},{"$f":"(Site!$B$32*($G$6*$C32+$G$7*$D32)*3630)*Site!$B$34*0.3048^3/454*Site!$B$31/Site!$B$32*Site!$B$36","v":0},{"$f":"IFERROR(($R32+$S32)*($F32+$G32*$Q32/100)/$H32,0)","v":0},{"$f":"$R32+$S32-$T32","v":0}]
["4.b. Grass Channel C/D Soils (Spec #3)",10,null,null,{"$f":"SUMIF($N$13:$N$92,$P132,$G$13:$G$92)","v":0},{"$f":"(Site!$B$32*($G$6*$C33+$G$7*$D33)*3630+$E33)*$B33/100","v":0},{"$f":"(Site!$B$32*($G$6*$C33+$G$7*$D33)*3630+$E33)*(1-$B33/100)","v":0},{"$f":"+$F33+$G33","v":0},15,{"$f":"SUMIF($N$13:$N$92,$P132,$M$13:$M$92)","v":0},{"$f":"(Site!$B$32*($G$6*$C33+$G$7*$D33)*3630)*Site!$B$33*0.3048^3/454*Site!$B$31/Site!$B$32*Site!$B$36","v":0},{"$f":"IFERROR(($J33+$K33)*($F33+$G33*$I33/100)/$H33,0)","v":0},{"$f":"$J33+$K33-$L33","v":0},null,null,null,20,{"$f":"SUMIF($N$13:$N$92,$P132,$U$13:$U$92)","v":0},{"$f":"(Site!$B$32*($G$6*$C33+$G$7*$D33)*3630)*Site!$B$34*0.3048^3/454*Site!$B$31/Site!$B$32*Site!$B$36","v":0},{"$f":"IFERROR(($R33+$S33)*($F33+$G33*$Q33/100)/$H33,0)","v":0},{"$f":"$R33+$S33-$T33","v":0}]
["4.c. Grass Channel with Compost Amended Soils as per specs (see Spec #4)",{"$f":"IF(Site!$J$11=\"2011 Stds & Specs\",30,20)","v":20},null,null,0,{"$f":"(Site!$B$32*($G$6*$C34+$G$7*$D34)*3630+$E34)*$B34/100","v":0},{"$f":"(Site!$B$32*($G$6*$C34+$G$7*$D34)*3630+$E34)*(1-$B34/100)","v":0},0,15,{"$f":"SUMIF($N$13:$N$92,$P133,$M$13:$M$92)","v":0},{"$f":"(Site!$B$32*($G$6*$C34+$G$7*$D34)*3630)*Site!$B$33*0.3048^3/454*Site!$B$31/Site!$B$32*Site!$B$36","v":0},0,0,null,null,null,20,0,{"$f":"(Site!$B$32*($G$6*$C34+$G$7*$D34)*3630)*Site!$B$34*0.3048^3/454*Site!$B$31/Site!$B$32*Site!$B$36","v":0},0,0]
[null,null,null,null,null,null,null,null,null,null,null,null,null,null,null,null,null,null,null,null,null,null,"`"]
["5. Dry Swale (RR)",null,null,null,null,null,null,null,null,null,null,null,null,null,null,null,"5. Dry Swale (RR)"]
["5.a. Dry Swale #1 (Spec #10)",40,null,null,{"$f":"SUMIF($N$13:$N$92,$P134,$G$13:$G$92)","v":0},{"$f":"(Site!$B$32*($G$6*$C37+$G$7*$D37)*3630+$E37)*$B37/100","v":0},{"$f":"(Site!$B$32*($G$6*$C37+$G$7*$D37)*3630+$E37)*(1-$B37/100)","v":0},{"$f":"+$F37+$G37","v":0},20,{"$f":"SUMIF($N$13:$N$92,$P134,$M$13:$M$92)","v":0},{"$f":"(Site!$B$32*($G$6*$C37+$G$7*$D37)*3630)*Site!$B$33*0.3048^3/454*Site!$B$31/Site!$B$32*Site!$B$36","v":0},{"$f":"IFERROR(($J37+$K37)*($F37+$G37*$I37/100)/$H37,0)","v":0},{"$f":"$J37+$K37-$L37","v":0},null,null,null,25,{"$f":"SUMIF($N$13:$N$92,$P134,$U$13:$U$92)","v":0},{"$f":"(Site!$B$32*($G$6*$C37+$G$7*$D37)*3630)*Site!$B$34*0.3048^3/454*Site!$B$31/Site!$B$32*Site!$B$36","v":0},{"$f":"IFERROR(($R37+$S37)*($F37+$G37*$Q37/100)/$H37,0)","v":0},{"$f":"$R37+$S37-$T37","v":0}]
["5.b. Dry Swale #2 (Spec #10)",60,null,null,{"$f":"SUMIF($N$13:$N$92,$P135,$G$13:$G$92)","v":0},{"$f":"(Site!$B$32*($G$6*$C38+$G$7*$D38)*3630+$E38)*$B38/100","v":0},{"$f":"(Site!$B$32*($G$6*$C38+$G$7*$D38)*3630+$E38)*(1-$B38/100)","v":0},{"$f":"+$F38+$G38","v":0},40,{"$f":"SUMIF($N$13:$N$92,$P135,$M$13:$M$92)","v":0},{"$f":"(Site!$B$32*($G$6*$C38+$G$7*$D38)*3630)*Site!$B$33*0.3048^3/454*Site!$B$31/Site!$B$32*Site!$B$36","v":0},{"$f":"IFERROR(($J38+$K38)*($F38+$G38*$I38/100)/$H38,0)","v":0},{"$f":"$J38+$K38-$L38","v":0},null,null,null,35,{"$f":"SUMIF($N$13:$N$92,$P135,$U$13:$U$92)","v":0},{"$f":"(Site!$B$32*($G$6*$C38+$G$7*$D38)*3630)*Site!$B$34*0.3048^3/454*Site!$B$31/Site!$B$32*Site!$B$36","v":0},0,0]
[]
["6. Bioretention (RR)",null,null,null,null,null,null,null,null,null,null,null,null,null,null,null,"6. Bioretention (RR)"]
["6.a. Bioretention #1 or Micro-Bioretention #1 or Urban Bioretention (Spec #9)",40,null,null,{"$f":"SUMIF($N$13:$N$92,$P136,$G$13:$G$92)","v":0},{"$f":"(Site!$B$32*($G$6*$C41+$G$7*$D41)*3630+$E41)*$B41/100","v":0},{"$f":"(Site!$B$32*($G$6*$C41+$G$7*$D41)*3630+$E41)*(1-$B41/100)","v":0},{"$f":"+$F41+$G41","v":0},25,{"$f":"SUMIF($N$13:$N$92,$P136,$M$13:$M$92)","v":0},{"$f":"(Site!$B$32*($G$6*$C41+$G$7*$D41)*3630)*Site!$B$33*0.3048^3/454*Site!$B$31/Site!$B$32*Site!$B$36","v":0},{"$f":"IFERROR(($J41+$K41)*($F41+$G41*$I41/100)/$H41,0)","v":0},{"$f":"$J41+$K41-$L41","v":0},null,null,null,40,{"$f":"SUMIF($N$13:$N$92,$P136,$U$13:$U$92)","v":0},{"$f":"(Site!$B$32*($G$6*$C41+$G$7*$D41)*3630)*Site!$B$34*0.3048^3/454*Site!$B$31/Site!$B$32*Site!$B$36","v":0},{"$f":"IFERROR(($R41+$S41)*($F41+$G41*$Q41/100)/$H41,0)","v":0},{"$f":"$R41+$S41-$T41","v":0}]
["6.b. Bioretention #2 or Micro-Bioretention #2 (Spec #9)",80,null,null,{"$f":"SUMIF($N$13:$N$92,$P137,$G$13:$G$92)","v":0},{"$f":"(Site!$B$32*($G$6*$C42+$G$7*$D42)*3630+$E42)*$B42/100","v":0},{"$f":"(Site!$B$32*($G$6*$C42+$G$7*$D42)*3630+$E42)*(1-$B42/100)","v":0},{"$f":"+$F42+$G42","v":0},50,{"$f":"SUMIF($N$13:$N$92,$P137,$M$13:$M$92)","v":0},{"$f":"(Site!$B$32*($G$6*$C42+$G$7*$D42)*3630)*Site!$B$33*0.3048^3/454*Site!$B$31/Site!$B$32*Site!$B$36","v":0},{"$f":"IFERROR(($J42+$K42)*($F42+$G42*$I42/100)/$H42,0)","v":0},{"$f":"$J42+$K42-$L42","v":0},null,null,null,60,{"$f":"SUMIF($N$13:$N$92,$P137,$U$13:$U$92)","v":0},{"$f":"(Site!$B$32*($G$6*$C42+$G$7*$D42)*3630)*Site!$B$34*0.3048^3/454*Site!$B$31/Site!$B$32*Site!$B$36","v":0},0,0]
[]
["7. Infiltration (RR)",null,null,null,null,null,null,null,null,null,null,null,null,null,null,null,"7. Infiltration (RR)"]
["7.a. Infiltration #1 (Spec #8)",50,null,null,{"$f":"SUMIF($N$13:$N$92,$P138,$G$13:$G$92)","v":0},{"$f":"(Site!$B$32*($G$6*$C45+$G$7*$D45)*3630+$E45)*$B45/100","v":0},{"$f":"(Site!$B$32*($G$6*$C45+$G$7*$D45)*3630+$E45)*(1-$B45/100)","v":0},{"$f":"+$F45+$G45","v":0},25,{"$f":"SUMIF($N$13:$N$92,$P138,$M$13:$M$92)","v":0},{"$f":"(Site!$B$32*($G$6*$C45+$G$7*$D45)*3630)*Site!$B$33*0.3048^3/454*Site!$B$31/Site!$B$32*Site!$B$36","v":0},{"$f":"IFERROR(($J45+$K45)*($F45+$G45*$I45/100)/$H45,0)","v":0},{"$f":"$J45+$K45-$L45","v":0},null,null,null,15,{"$f":"SUMIF($N$13:$N$92,$P138,$U$13:$U$92)","v":0},{"$f":"(Site!$B$32*($G$6*$C45+$G$7*$D45)*3630)*Site!$B$34*0.3048^3/454*Site!$B$31/Site!$B$32*Site!$B$36","v":0},{"$f":"IFERROR(($R45+$S45)*($F45+$G45*$Q45/100)/$H45,0)","v":0},{"$f":"$R45+$S45-$T45","v":0}]
["7.b. Infiltration #2 (Spec #8)",90,null,null,{"$f":"SUMIF($N$13:$N$92,$P139,$G$13:$G$92)","v":0},{"$f":"(Site!$B$32*($G$6*$C46+$G$7*$D46)*3630+$E46)*$B46/100","v":0},{"$f":"(Site!$B$32*($G$6*$C46+$G$7*$D46)*3630+$E46)*(1-$B46/100)","v":0},{"$f":"+$F46+$G46","v":0},25,{"$f":"SUMIF($N$13:$N$92,$P139,$M$13:$M$92)","v":0},{"$f":"(Site!$B$32*($G$6*$C46+$G$7*$D46)*3630)*Site!$B$33*0.3048^3/454*Site!$B$31/Site!$B$32*Site!$B$36","v":0},{"$f":"IFERROR(($J46+$K46)*($F46+$G46*$I46/100)/$H46,0)","v":0},{"$f":"$J46+$K46-$L46","v":0},null,null,null,15,{"$f":"SUMIF($N$13:$N$92,$P139,$U$13:$U$92)","v":0},{"$f":"(Site!$B$32*($G$6*$C46+$G$7*$D46)*3630)*Site!$B$34*0.3048^3/454*Site!$B$31/Site!$B$32*Site!$B$36","v":0},0,0]
[]
["8. Extended Detention Pond (RR)",null,null,null,null,null,null,null,null,null,null,null,null,null,null,null,"8. Extended Detention Pond (RR)"]
["8.a. ED #1 (Spec #15)",0,null,null,{"$f":"SUMIF($N$13:$N$92,$P140,$G$13:$G$92)","v":0},{"$f":"(Site!$B$32*($G$6*$C49+$G$7*$D49)*3630+$E49)*$B49/100","v":0},{"$f":"(Site!$B$32*($G$6*$C49+$G$7*$D49)*3630+$E49)*(1-$B49/100)","v":0},{"$f":"+$F49+$G49","v":0},15,{"$f":"SUMIF($N$13:$N$92,$P140,$M$13:$M$92)","v":0},{"$f":"(Site!$B$32*($G$6*$C49+$G$7*$D49)*3630)*Site!$B$33*0.3048^3/454*Site!$B$31/Site!$B$32*Site!$B$36","v":0},{"$f":"IFERROR(($J49+$K49)*($F49+$G49*$I49/100)/$H49,0)","v":0},{"$f":"$J49+$K49-$L49","v":0},null,null,null,10,{"$f":"SUMIF($N$13:$N$92,$P140,$U$13:$U$92)","v":0},{"$f":"(Site!$B$32*($G$6*$C49+$G$7*$D49)*3630)*Site!$B$34*0.3048^3/454*Site!$B$31/Site!$B$32*Site!$B$36","v":0},{"$f":"IFERROR(($R49+$S49)*($F49+$G49*$Q49/100)/$H49,0)","v":0},{"$f":"$R49+$S49-$T49","v":0}]
["8.b. ED #2 (Spec #15)",15,null,null,{"$f":"SUMIF($N$13:$N$92,$P141,$G$13:$G$92)","v":0},{"$f":"(Site!$B$32*($G$6*$C50+$G$7*$D50)*3630+$E50)*$B50/100","v":0},{"$f":"(Site!$B$32*($G$6*$C50+$G$7*$D50)*3630+$E50)*(1-$B50/100)","v":0},{"$f":"+$F50+$G50","v":0},15,{"$f":"SUMIF($N$13:$N$92,$P141,$M$13:$M$92)","v":0},{"$f":"(Site!$B$32*($G$6*$C50+$G$7*$D50)*3630)*Site!$B$33*0.3048^3/454*Site!$B$31/Site!$B$32*Site!$B$36","v":0},0,0,null,null,null,10,{"$f":"SUMIF($N$13:$N$92,$P141,$U$13:$U$92)","v":0},{"$f":"(Site!$B$32*($G$6*$C50+$G$7*$D50)*3630)*Site!$B$34*0.3048^3/454*Site!$B$31/Site!$B$32*Site!$B$36","v":0},0,0]
[]
["9. Sheetflow to Filter/Open Space (RR)",null,null,null,null,null,null,null,null,null,null,null,null,null,null,null,"9. Sheetflow to Filter/Open Space (RR)"]
["9.a. Sheetflow to Conservation Area, A/B Soils (Spec #2)",75,null,null,{"$f":"SUMIF($N$13:$N$92,$P142,$G$13:$G$92)","v":0},{"$f":"(Site!$B$32*($G$6*$C53+$G$7*$D53)*3630+$E53)*$B53/100","v":0},{"$f":"(Site!$B$32*($G$6*$C53+$G$7*$D53)*3630+$E53)*(1-$B53/100)","v":0},{"$f":"+$F53+$G53","v":0},0,{"$f":"SUMIF($N$13:$N$92,$P142,$M$13:$M$92)","v":0},{"$f":"(Site!$B$32*($G$6*$C53+$G$7*$D53)*3630)*Site!$B$33*0.3048^3/454*Site!$B$31/Site!$B$32*Site!$B$36","v":0},{"$f":"IFERROR(($J53+$K53)*($F53+$G53*$I53/100)/$H53,0)","v":0},{"$f":"$J53+$K53-$L53","v":0},null,null,null,0,{"$f":"SUMIF($N$13:$N$92,$P142,$U$13:$U$92)","v":0},{"$f":"(Site!$B$32*($G$6*$C53+$G$7*$D53)*3630)*Site!$B$34*0.3048^3/454*Site!$B$31/Site!$B$32*Site!$B$36","v":0},{"$f":"IFERROR(($R53+$S53)*($F53+$G53*$Q53/100)/$H53,0)","v":0},{"$f":"$R53+$S53-$T53","v":0}]
["9.b. Sheetflow to Conservation Area, C/D Soils (Spec #2)",50,null,null,{"$f":"SUMIF($N$13:$N$92,$P143,$G$13:$G$92)","v":0},{"$f":"(Site!$B$32*($G$6*$C54+$G$7*$D54)*3630+$E54)*$B54/100","v":0},{"$f":"(Site!$B$32*($G$6*$C54+$G$7*$D54)*3630+$E54)*(1-$B54/100)","v":0},{"$f":"+$F54+$G54","v":0},0,{"$f":"SUMIF($N$13:$N$92,$P143,$M$13:$M$92)","v":0},{"$f":"(Site!$B$32*($G$6*$C54+$G$7*$D54)*3630)*Site!$B$33*0.3048^3/454*Site!$B$31/Site!$B$32*Site!$B$36","v":0},0,0,null,null,null,0,{"$f":"SUMIF($N$13:$N$92,$P143,$U$13:$U$92)","v":0},{"$f":"(Site!$B$32*($G$6*$C54+$G$7*$D54)*3630)*Site!$B$34*0.3048^3/454*Site!$B$31/Site!$B$32*Site!$B$36","v":0},0,0]
["9.c. Sheetflow to Vegetated Filter Strip, A Soils or Compost Amended B/C/D Soils \n(Spec #2 & #4)",50,null,null,0,{"$f":"(Site!$B$32*($G$6*$C55+$G$7*$D55)*3630+$E55)*$B55/100","v":0},{"$f":"(Site!$B$32*($G$6*$C55+$G$7*$D55)*3630+$E55)*(1-$B55/100)","v":0},0,0,0,{"$f":"(Site!$B$32*($G$6*$C55+$G$7*$D55)*3630)*Site!$B$33*0.3048^3/454*Site!$B$31/Site!$B$32*Site!$B$36","v":0},0,0,null,null,null,0,0,{"$f":"(Site!$B$32*($G$6*$C55+$G$7*$D55)*3630)*Site!$B$34*0.3048^3/454*Site!$B$31/Site!$B$32*Site!$B$36","v":0},0,0]
[]
[]
[null,null,null,null,"TOTAL IMPERVIOUS COVER TREATED (ac)",{"$f":"SUM(D13:D55)","v":0},"AREA CHECK:",{"$f":"IF(F58>$F$7,\"AREA EXCEEDED!\",\"OK.\")","v":"OK."}]
[null,null,null,null,"TOTAL MANAGED TURF AREA TREATED (ac)",{"$f":"SUM(C32:C55)","v":0},"AREA CHECK:",{"$f":"IF(F59>$F$6,\"AREA EXCEEDED!\",\"OK.\")","v":"OK."}]
[null,null,null,null,"TOTAL RUNOFF REDUCTION IN D.A. C (ft3)",{"$f":"IFERROR(SUM($F$13:$F$55),0)","v":0}]
[]
[null,null,null,null,null,null,null,"TOTAL PHOSPHORUS AVAILABLE FOR REMOVAL IN D.A. C (lb/yr)",{"$f":"$M$7","v":0}]
[null,null,null,null,null,null,null,"TOTAL PHOSPHORUS REMOVED WITH RUNOFF REDUCTION PRACTICES IN D.A. C (lb/yr)",{"$f":"IFERROR(SUM(L13:L55),0)","v":0},null,null,null,null,null,null,null,null,null,null,null,"TOTAL RUNOFF REDUCTION IN D.A. C (ft3)",{"$f":"F60","v":0}]
[null,null,null,null,null,null,null,"TOTAL PHOSPHORUS REMAINING AFTER APPLYING RUNOFF REDUCTION PRACTICES IN D.A. C (lb/yr)",{"$f":"I62-I63","v":0},null,null,null,null,null,null,null,null,null,null,null,"NITROGEN REMOVED WITH RUNOFF REDUCTION PRACTICES IN D.A. C (lb/yr)",{"$f":"SUM($T$13:$T$55)","v":0}]
[]
[null,null,"SEE WATER QUALITY COMPLIANCE TAB FOR SITE COMPLIANCE CALCULATIONS",null,null,null,null,null,null,null,null,null,null,null,null,null,null,null,null,null,null,"           SEE WATER QUALITY COMPLIANCE TAB FOR SITE CALCULATIONS (Information Only)"]
[]
[]
[]
[]
["10. Wet Swale (no RR)",null,null,null,null,null,null,null,null,null,null,null,null,null,null,null,null,"10. Wet Swale (Coastal Plain) (no RR)"]
["10.a. Wet Swale #1 (Spec #11)",0,null,null,{"$f":"SUMIF($N$13:$N$92,$P145,$G$13:$G$92)","v":0},{"$f":"(Site!$B$32*($G$6*$C72+$G$7*$D72)*3630+$E72)*$B72/100","v":0},{"$f":"(Site!$B$32*($G$6*$C72+$G$7*$D72)*3630+$E72)*(1-$B72/100)","v":0},{"$f":"+$F72+$G72","v":0},20,{"$f":"SUMIF($N$13:$N$92,$P145,$M$13:$M$92)","v":0},{"$f":"(Site!$B$32*($G$6*$C72+$G$7*$D72)*3630)*Site!$B$33*0.3048^3/454*Site!$B$31/Site!$B$32*Site!$B$36","v":0},{"$f":"IFERROR(($J72+$K72)*($F72+$G72*$I72/100)/$H72,0)","v":0},{"$f":"$J72+$K72-$L72","v":0},null,null,null,25,{"$f":"SUMIF($N$13:$N$92,$P145,$U$13:$U$92)","v":0},{"$f":"(Site!$B$32*($G$6*$C72+$G$7*$D72)*3630)*Site!$B$34*0.3048^3/454*Site!$B$31/Site!$B$32*Site!$B$36","v":0},{"$f":"IFERROR(($R72+$S72)*($F72+$G72*$Q72/100)/$H72,0)","v":0},{"$f":"$R72+$S72-$T72","v":0}]
["10.b. Wet Swale #2 (Spec #11)",0,null,null,{"$f":"SUMIF($N$13:$N$92,$P146,$G$13:$G$92)","v":0},{"$f":"(Site!$B$32*($G$6*$C73+$G$7*$D73)*3630+$E73)*$B73/100","v":0},{"$f":"(Site!$B$32*($G$6*$C73+$G$7*$D73)*3630+$E73)*(1-$B73/100)","v":0},0,40,{"$f":"SUMIF($N$13:$N$92,$P146,$M$13:$M$92)","v":0},{"$f":"(Site!$B$32*($G$6*$C73+$G$7*$D73)*3630)*Site!$B$33*0.3048^3/454*Site!$B$31/Site!$B$32*Site!$B$36","v":0},0,0,null,null,null,35,{"$f":"SUMIF($N$13:$N$92,$P146,$U$13:$U$92)","v":0},{"$f":"(Site!$B$32*($G$6*$C73+$G$7*$D73)*3630)*Site!$B$34*0.3048^3/454*Site!$B$31/Site!$B$32*Site!$B$36","v":0},0,0]
[]
["11.  Filtering Practices (no RR)",null,null,null,null,null,null,null,null,null,null,null,null,null,null,null,"11.  Filtering Practices (no RR)"]
["11.a.Filtering Practice #1 (Spec #12)",0,null,null,{"$f":"SUMIF($N$13:$N$92,$P147,$G$13:$G$92)","v":0},{"$f":"(Site!$B$32*($G$6*$C76+$G$7*$D76)*3630+$E76)*$B76/100","v":0},{"$f":"(Site!$B$32*($G$6*$C76+$G$7*$D76)*3630+$E76)*(1-$B76/100)","v":0},{"$f":"+$F76+$G76","v":0},60,{"$f":"SUMIF($N$13:$N$92,$P147,$M$13:$M$92)","v":0},{"$f":"(Site!$B$32*($G$6*$C76+$G$7*$D76)*3630)*Site!$B$33*0.3048^3/454*Site!$B$31/Site!$B$32*Site!$B$36","v":0},{"$f":"IFERROR(($J76+$K76)*($F76+$G76*$I76/100)/$H76,0)","v":0},{"$f":"$J76+$K76-$L76","v":0},null,null,null,30,{"$f":"SUMIF($N$13:$N$92,$P147,$U$13:$U$92)","v":0},{"$f":"(Site!$B$32*($G$6*$C76+$G$7*$D76)*3630)*Site!$B$34*0.3048^3/454*Site!$B$31/Site!$B$32*Site!$B$36","v":0},{"$f":"IFERROR(($R76+$S76)*($F76+$G76*$Q76/100)/$H76,0)","v":0},{"$f":"$R76+$S76-$T76","v":0}]
["11.b. Filtering Practice #2 (Spec #12)",0,null,null,{"$f":"SUMIF($N$13:$N$92,$P148,$G$13:$G$92)","v":0},{"$f":"(Site!$B$32*($G$6*$C77+$G$7*$D77)*3630+$E77)*$B77/100","v":0},{"$f":"(Site!$B$32*($G$6*$C77+$G$7*$D77)*3630+$E77)*(1-$B77/100)","v":0},0,65,{"$f":"SUMIF($N$13:$N$92,$P148,$M$13:$M$92)","v":0},{"$f":"(Site!$B$32*($G$6*$C77+$G$7*$D77)*3630)*Site!$B$33*0.3048^3/454*Site!$B$31/Site!$B$32*Site!$B$36","v":0},0,0,null,null,null,45,{"$f":"SUMIF($N$13:$N$92,$P148,$U$13:$U$92)","v":0},{"$f":"(Site!$B$32*($G$6*$C77+$G$7*$D77)*3630)*Site!$B$34*0.3048^3/454*Site!$B$31/Site!$B$32*Site!$B$36","v":0},0,0]
[]
["12. Constructed Wetland (no RR)",null,null,null,null,null,null,null,null,null,null,null,null,null,null,null,"12. Constructed Wetland (no RR)"]
["12.a.Constructed Wetland #1 (Spec #13)",0,null,null,{"$f":"SUMIF($N$13:$N$92,$P149,$G$13:$G$92)","v":0},{"$f":"(Site!$B$32*($G$6*$C80+$G$7*$D80)*3630+$E80)*$B80/100","v":0},{"$f":"(Site!$B$32*($G$6*$C80+$G$7*$D80)*3630+$E80)*(1-$B80/100)","v":0},{"$f":"+$F80+$G80","v":0},50,{"$f":"SUMIF($N$13:$N$92,$P149,$M$13:$M$92)","v":0},{"$f":"(Site!$B$32*($G$6*$C80+$G$7*$D80)*3630)*Site!$B$33*0.3048^3/454*Site!$B$31/Site!$B$32*Site!$B$36","v":0},{"$f":"IFERROR(($J80+$K80)*($F80+$G80*$I80/100)/$H80,0)","v":0},{"$f":"$J80+$K80-$L80","v":0},null,null,null,25,{"$f":"SUMIF($N$13:$N$92,$P149,$U$13:$U$92)","v":0},{"$f":"(Site!$B$32*($G$6*$C80+$G$7*$D80)*3630)*Site!$B$34*0.3048^3/454*Site!$B$31/Site!$B$32*Site!$B$36","v":0},{"$f":"IFERROR(($R80+$S80)*($F80+$G80*$Q80/100)/$H80,0)","v":0},{"$f":"$R80+$S80-$T80","v":0}]
["12.b. Constructed Wetland #2 (Spec #13)",0,null,null,{"$f":"SUMIF($N$13:$N$92,$P150,$G$13:$G$92)","v":0},{"$f":"(Site!$B$32*($G$6*$C81+$G$7*$D81)*3630+$E81)*$B81/100","v":0},{"$f":"(Site!$B$32*($G$6*$C81+$G$7*$D81)*3630+$E81)*(1-$B81/100)","v":0},0,75,{"$f":"SUMIF($N$13:$N$92,$P150,$M$13:$M$92)","v":0},{"$f":"(Site!$B$32*($G$6*$C81+$G$7*$D81)*3630)*Site!$B$33*0.3048^3/454*Site!$B$31/Site!$B$32*Site!$B$36","v":0},0,0,null,null,null,55,{"$f":"SUMIF($N$13:$N$92,$P150,$U$13:$U$92)","v":0},{"$f":"(Site!$B$32*($G$6*$C81+$G$7*$D81)*3630)*Site!$B$34*0.3048^3/454*Site!$B$31/Site!$B$32*Site!$B$36","v":0},0,0]
[]
["13. Wet Ponds (no RR)",null,null,null,null,null,null,null,null,null,null,null,null,null,null,null,"13. Wet Ponds (no RR)"]
["13.a. Wet Pond #1 (Spec #14)",0,null,null,{"$f":"SUMIF($N$13:$N$92,$P151,$G$13:$G$92)","v":0},{"$f":"(Site!$B$32*($G$6*$C84+$G$7*$D84)*3630+$E84)*$B84/100","v":0},{"$f":"(Site!$B$32*($G$6*$C84+$G$7*$D84)*3630+$E84)*(1-$B84/100)","v":0},{"$f":"+$F84+$G84","v":0},50,{"$f":"SUMIF($N$13:$N$92,$P151,$M$13:$M$92)","v":0},{"$f":"(Site!$B$32*($G$6*$C84+$G$7*$D84)*3630)*Site!$B$33*0.3048^3/454*Site!$B$31/Site!$B$32*Site!$B$36","v":0},{"$f":"IFERROR(($J84+$K84)*($F84+$G84*$I84/100)/$H84,0)","v":0},{"$f":"$J84+$K84-$L84","v":0},null,null,null,30,{"$f":"SUMIF($N$13:$N$92,$P151,$U$13:$U$92)","v":0},{"$f":"(Site!$B$32*($G$6*$C84+$G$7*$D84)*3630)*Site!$B$34*0.3048^3/454*Site!$B$31/Site!$B$32*Site!$B$36","v":0},{"$f":"IFERROR(($R84+$S84)*($F84+$G84*$Q84/100)/$H84,0)","v":0},{"$f":"$R84+$S84-$T84","v":0}]
["13.b. Wet Pond #1 (Coastal Plain) (Spec #14)",0,null,null,{"$f":"SUMIF($N$13:$N$92,$P152,$G$13:$G$92)","v":0},{"$f":"(Site!$B$32*($G$6*$C85+$G$7*$D85)*3630+$E85)*$B85/100","v":0},{"$f":"(Site!$B$32*($G$6*$C85+$G$7*$D85)*3630+$E85)*(1-$B85/100)","v":0},0,45,{"$f":"SUMIF($N$13:$N$92,$P152,$M$13:$M$92)","v":0},{"$f":"(Site!$B$32*($G$6*$C85+$G$7*$D85)*3630)*Site!$B$33*0.3048^3/454*Site!$B$31/Site!$B$32*Site!$B$36","v":0},0,0,null,null,null,20,{"$f":"SUMIF($N$13:$N$92,$P152,$U$13:$U$92)","v":0},{"$f":"(Site!$B$32*($G$6*$C85+$G$7*$D85)*3630)*Site!$B$34*0.3048^3/454*Site!$B$31/Site!$B$32*Site!$B$36","v":0},0,0]
["13.c. Wet Pond #2 (Spec #14)",0,null,null,0,{"$f":"(Site!$B$32*($G$6*$C86+$G$7*$D86)*3630+$E86)*$B86/100","v":0},{"$f":"(Site!$B$32*($G$6*$C86+$G$7*$D86)*3630+$E86)*(1-$B86/100)","v":0},0,75,0,{"$f":"(Site!$B$32*($G$6*$C86+$G$7*$D86)*3630)*Site!$B$33*0.3048^3/454*Site!$B$31/Site!$B$32*Site!$B$36","v":0},0,0,null,null,null,40,0,{"$f":"(Site!$B$32*($G$6*$C86+$G$7*$D86)*3630)*Site!$B$34*0.3048^3/454*Site!$B$31/Site!$B$32*Site!$B$36","v":0},0,0]
["13.d. Wet Pond #2 (Coastal Plain) (Spec #14)",0,null,null,0,{"$f":"(Site!$B$32*($G$6*$C87+$G$7*$D87)*3630+$E87)*$B87/100","v":0},{"$f":"(Site!$B$32*($G$6*$C87+$G$7*$D87)*3630+$E87)*(1-$B87/100)","v":0},0,65,0,{"$f":"(Site!$B$32*($G$6*$C87+$G$7*$D87)*3630)*Site!$B$33*0.3048^3/454*Site!$B$31/Site!$B$32*Site!$B$36","v":0},0,0,null,null,null,30,0,{"$f":"(Site!$B$32*($G$6*$C87+$G$7*$D87)*3630)*Site!$B$34*0.3048^3/454*Site!$B$31/Site!$B$32*Site!$B$36","v":0},0,0]
[]
["14. Manufactured Treatment Devices (no RR)",null,null,null,null,null,null,null,null,null,null,null,null,null,null,null,null,"14. Manufactured BMP (no RR)"]
["14.a. Manufactured Treatment Device-Hydrodynamic",0,null,null,{"$f":"SUMIF($N$13:$N$92,$P155,$G$13:$G$92)","v":0},{"$f":"(Site!$B$32*($G$6*$C90+$G$7*$D90)*3630+$E90)*$B90/100","v":0},{"$f":"(Site!$B$32*($G$6*$C90+$G$7*$D90)*3630+$E90)*(1-$B90/100)","v":0},{"$f":"+$F90+$G90","v":0},20,{"$f":"SUMIF($N$13:$N$92,$P155,$M$13:$M$92)","v":0},{"$f":"(Site!$B$32*($G$6*$C90+$G$7*$D90)*3630)*Site!$B$33*0.3048^3/454*Site!$B$31/Site!$B$32*Site!$B$36","v":0},{"$f":"IFERROR(($J90+$K90)*($F90+$G90*$I90/100)/$H90,0)","v":0},{"$f":"$J90+$K90-$L90","v":0},null,null,null,0,{"$f":"SUMIF($N$13:$N$92,$P155,$U$13:$U$92)","v":0},{"$f":"(Site!$B$32*($G$6*$C90+$G$7*$D90)*3630)*Site!$B$34*0.3048^3/454*Site!$B$31/Site!$B$32*Site!$B$36","v":0},{"$f":"IFERROR(($R90+$S90)*($F90+$G90*$Q90/100)/$H90,0)","v":0},{"$f":"$R90+$S90-$T90","v":0}]
["14.b. Manufactured Treatment Device-Filtering",0,null,null,{"$f":"SUMIF($N$13:$N$92,$P156,$G$13:$G$92)","v":0},{"$f":"(Site!$B$32*($G$6*$C91+$G$7*$D91)*3630+$E91)*$B91/100","v":0},{"$f":"(Site!$B$32*($G$6*$C91+$G$7*$D91)*3630+$E91)*(1-$B91/100)","v":0},0,20,{"$f":"SUMIF($N$13:$N$92,$P156,$M$13:$M$92)","v":0},{"$f":"(Site!$B$32*($G$6*$C91+$G$7*$D91)*3630)*Site!$B$33*0.3048^3/454*Site!$B$31/Site!$B$32*Site!$B$36","v":0},0,0,null,null,null,0,{"$f":"SUMIF($N$13:$N$92,$P156,$U$13:$U$92)","v":0},{"$f":"(Site!$B$32*($G$6*$C91+$G$7*$D91)*3630)*Site!$B$34*0.3048^3/454*Site!$B$31/Site!$B$32*Site!$B$36","v":0},0,0]
["14.c. Manufactured Treatment Device-Generic",0,null,null,0,{"$f":"(Site!$B$32*($G$6*$C92+$G$7*$D92)*3630+$E92)*$B92/100","v":0},{"$f":"(Site!$B$32*($G$6*$C92+$G$7*$D92)*3630+$E92)*(1-$B92/100)","v":0},0,20,0,{"$f":"(Site!$B$32*($G$6*$C92+$G$7*$D92)*3630)*Site!$B$33*0.3048^3/454*Site!$B$31/Site!$B$32*Site!$B$36","v":0},0,0,null,null,null,0,0,{"$f":"(Site!$B$32*($G$6*$C92+$G$7*$D92)*3630)*Site!$B$34*0.3048^3/454*Site!$B$31/Site!$B$32*Site!$B$36","v":0},0,0]
[]
[]
[]
[null,null,null,null,"TOTAL IMPERVIOUS COVER TREATED (ac)",{"$f":"SUM($D$13:$D$92)","v":0},"AREA CHECK:",{"$f":"IF($F$96>$F$7,\"AREA EXCEEDED!\",\"OK.\")","v":"OK."}]
[null,null,null,null,"TOTAL MANAGED TURF AREA TREATED (ac)",{"$f":"SUM($C$13:$C$92)","v":0},"AREA CHECK:",{"$f":"IF($F$97>$F$6,\"AREA EXCEEDED!\",\"OK.\")","v":"OK."}]
[]
[null,null,null,null,null,null,null,"TOTAL PHOSPHORUS REMOVAL REQUIRED ON SITE (lb/yr)",{"$f":"IF(Site!G63=\"Check Areas!\",\"ERROR - \",Site!G63)","v":"--"},{"$f":"IF(I99=\"ERROR - \",\"Site Data Tab\",\"\")","v":""}]
[]
[null,null,null,null,null,null,null,"TOTAL PHOSPHORUS AVAILABLE FOR REMOVAL IN D.A. C (lb/yr)",{"$f":"$M$7","v":0}]
[null,null,null,null,null,null,null,"TOTAL PHOSPHORUS REMOVED WITHOUT RUNOFF REDUCTION PRACTICES IN D.A. C (lb/yr)",{"$f":"SUM($L$72:$L$92)","v":0}]
[null,null,null,null,null,null,null,"TOTAL PHOSPHORUS REMOVED WITH RUNOFF REDUCTION PRACTICES IN D.A. C (lb/yr)",{"$f":"$I$63","v":0}]
[null,null,null,null,null,null,null,"TOTAL PHOSPHORUS LOAD REDUCTION ACHIEVED IN D.A. C (lb/yr)",{"$f":"$I$102+$I$103","v":0}]
[null,null,null,null,null,null,null,"TOTAL PHOSPHORUS REMAINING AFTER APPLYING BMP LOAD REDUCTIONS IN D.A. C (lb/yr)",{"$f":"$I$101-$I$104","v":0}]
[]
[null,null,"SEE WATER QUALITY COMPLIANCE TAB FOR SITE COMPLIANCE CALCULATIONS"]
[]
[null,null,null,null,null,null,null,"NITROGEN REMOVED WITH RUNOFF REDUCTION PRACTICES IN D.A. C (lb/yr)",{"$f":"IFERROR(SUM($T$13:$T$55),0)","v":0}]
[null,null,null,null,null,null,null,"NITROGEN REMOVED WITHOUT RUNOFF REDUCTION PRACTICES IN D.A. C (lb/yr)",{"$f":"SUM($T$72:$T$92)","v":0}]
[null,null,null,null,null,null,null,"TOTAL NITROGEN REMOVED IN D.A. C (lb/yr)",{"$f":"$I$109+$I$110","v":0}]
[]
[]
[]
[]
[null,null,"Downstream Practices - Dropdown selections for each applicable BMP"]
[]
["Options for 1. Green Roof",null,"Options for 2. Impervious Surface Disconnection",null,"Options for 3a. Pervious Parking, A/B Soils",null,"Options for 4a. Grass Channels, A/B Soils",null,null,"Options for 4b. Grass Channels, C/D Soils"]
[null,null,null,null,null,null,null,null,null,null,null,"Options for 4.c. Grass Channel Compost Amended Soils",null,null,null,"Master Downstream BMP Reference List"]
[{"$f":"P120","v":"None"},null,{"$f":"P120","v":"None"},null,{"$f":"P120","v":"None"},null,{"$f":"P120","v":"None"},null,null,{"$f":"P120","v":"None"},null,null,null,null,null,"None"]
["2.a. Simple Disconnection to A/B Soils",null,{"$f":"P131","v":"4.a. Grass Channel A/B Soils"},null,{"$f":"P131","v":"4.a. Grass Channel A/B Soils"},null,{"$f":"P132","v":"4.b. Grass Channel C/D Soils"},null,null,{"$f":"P131","v":"4.a. Grass Channel A/B Soils"},null,{"$f":"P120","v":"None"},null,null,null,"2.a. Simple Disconnection to A/B Soils"]
["2.b. Simple Disconnection to C/D Soils",null,"4.b. Grass Channel C/D Soils",null,"4.b. Grass Channel C/D Soils",null,"4.c. Grass Channel Compost Amended Soils",null,null,{"$f":"P133","v":"4.c. Grass Channel Compost Amended Soils"},null,{"$f":"P131","v":"4.a. Grass Channel A/B Soils"},null,null,null,"2.b. Simple Disconnection to C/D Soils"]
["2.c. To Soil Amended Filter Path",null,"4.c. Grass Channel Compost Amended Soils",null,"4.c. Grass Channel Compost Amended Soils",null,"5.a. Dry Swale #1",null,null,"5.a. Dry Swale #1",null,{"$f":"P132","v":"4.b. Grass Channel C/D Soils"},null,null,null,"2.c. To Soil Amended Filter Path"]
["2.d. To Dry Well/French Drain #1 (Micro-Infiltration #1)",null,"5.a. Dry Swale #1",null,"5.a. Dry Swale #1",null,"5.b. Dry Swale #2",null,null,"5.b. Dry Swale #2",null,{"$f":"P134","v":"5.a. Dry Swale #1"},null,null,null,"2.d. To Dry Well/French Drain #1 (Micro-Infiltration #1)"]
["2.e. To Dry Well/French Drain #2 (Micro-Infiltration. #2)",null,"5.b. Dry Swale #2",null,"5.b. Dry Swale #2",null,"6.a. Bioretention #1",null,null,"6.a. Bioretention #1",null,"5.b. Dry Swale #2",null,null,null,"2.e. To Dry Well/French Drain #2 (Micro-Infiltration. #2)"]
["2.f. To Rain Garden #1 (Micro-Bioretention #1)",null,"6.a. Bioretention #1",null,"6.a. Bioretention #1",null,"6.b. Bioretention #2",null,null,"6.b. Bioretention #2",null,"6.a. Bioretention #1",null,null,null,"2.f. To Rain Garden #1 (Micro-Bioretention #1)"]
["2.g. To Rain Garden #2 (Micro-Bioretention #2)",null,"6.b. Bioretention #2",null,"6.b. Bioretention #2",null,"7.a. Infiltration #1",null,null,"7.a. Infiltration #1",null,"6.b. Bioretention #2",null,null,null,"2.g. To Rain Garden #2 (Micro-Bioretention #2)"]
["2.h. To Train Barrel, Rain Tank, or Cistern",null,"7.a. Infiltration #1",null,"7.a. Infiltration #1",null,"7.b. Infiltration #2",null,null,"7.b. Infiltration #2",null,"7.a. Infiltration #1",null,null,null,"2.h. To Train Barrel, Rain Tank, or Cistern"]
["2.i. To Stormwater Planter (Urban Bioretention)",null,"7.b. Infiltration #2",null,"7.b. Infiltration #2",null,"8.a. ED #1",null,null,"8.a. ED #1",null,"7.b. Infiltration #2",null,null,null,"2.i. To Stormwater Planter (Urban Bioretention)"]
["3.a. Permeable Pavement #1",null,"8.a. ED #1",null,"8.a. ED #1",null,"8.b. ED #2",null,null,"8.b. ED #2",null,"8.a. ED #1",null,null,null,"3.a. Permeable Pavement #1"]
["4.a. Grass Channel A/B Soils",null,"8.b. ED #2",null,"8.b. ED #2",null,"9.a. Sheetflow to A/B Soil Conservation Area ",null,null,"9.a. Sheetflow to A/B Soil Conservation Area ",null,"8.b. ED #2",null,null,null,"4.a. Grass Channel A/B Soils"]
["4.b. Grass Channel C/D Soils",null,"9.a. Sheetflow to A/B Soil Conservation Area ",null,"9.a. Sheetflow to A/B Soil Conservation Area ",null,"9.b. Sheetflow to C/D Soil Conservation Area",null,null,"9.b. Sheetflow to C/D Soil Conservation Area",null,"9.a. Sheetflow to A/B Soil Conservation Area ",null,null,null,"4.b. Grass Channel C/D Soils"]
["4.c. Grass Channel Compost Amended Soils",null,"9.b. Sheetflow to C/D Soil Conservation Area",null,"9.b. Sheetflow to C/D Soil Conservation Area",null,"9.c. Sheetflow to Vegetated Filter Strip",null,null,"9.c. Sheetflow to Vegetated Filter Strip",null,"9.b. Sheetflow to C/D Soil Conservation Area",null,null,null,"4.c. Grass Channel Compost Amended Soils"]
["5.a. Dry Swale #1",null,"9.c. Sheetflow to Vegetated Filter Strip",null,"9.c. Sheetflow to Vegetated Filter Strip",null,"10.a. Wet Swale #1",null,null,"10.a. Wet Swale #1",null,"9.c. Sheetflow to Vegetated Filter Strip",null,null,null,"5.a. Dry Swale #1"]
["5.b. Dry Swale #2",null,"10.a. Wet Swale #1",null,"10.a. Wet Swale #1",null,"10.b. Wet Swale #2",null,null,"10.b. Wet Swale #2",null,"10.a. Wet Swale #1",null,null,null,"5.b. Dry Swale #2"]
["6.a. Bioretention #1",null,"10.b. Wet Swale #2",null,"10.b. Wet Swale #2",null,"11.a. Filtering Practice #1",null,null,"11.a. Filtering Practice #1",null,"10.b. Wet Swale #2",null,null,null,"6.a. Bioretention #1"]
["6.b. Bioretention #2",null,"11.a. Filtering Practice #1",null,"11.a. Filtering Practice #1",null,"11.b. Filtering Practice #2",null,null,"11.b. Filtering Practice #2",null,"11.a. Filtering Practice #1",null,null,null,"6.b. Bioretention #2"]
["7.a. Infiltration #1",null,"11.b. Filtering Practice #2",null,"11.b. Filtering Practice #2",null,"12.a. Constructed Wetland #1",null,null,"12.a. Constructed Wetland #1",null,"11.b. Filtering Practice #2",null,null,null,"7.a. Infiltration #1"]
["7.b. Infiltration #2",null,"12.a. Constructed Wetland #1",null,"12.a. Constructed Wetland #1",null,"12.b. Constructed Wetland #2",null,null,"12.b. Constructed Wetland #2",null,"12.a. Constructed Wetland #1",null,null,null,"7.b. Infiltration #2"]
["8.a. ED #1",null,"12.b. Constructed Wetland #2",null,"12.b. Constructed Wetland #2",null,"13.a. Wet Pond #1",null,null,"13.a. Wet Pond #1",null,"12.b. Constructed Wetland #2",null,null,null,"8.a. ED #1"]
["8.b. ED #2",null,"13.a. Wet Pond #1",null,"13.a. Wet Pond #1",null,"13.b. Wet Pond #1 (Coastal Plain)",null,null,"13.b. Wet Pond #1 (Coastal Plain)",null,"13.a. Wet Pond #1",null,null,null,"8.b. ED #2"]
["9.a. Sheetflow to A/B Soil Conservation Area ",null,"13.b. Wet Pond #1 (Coastal Plain)",null,"13.b. Wet Pond #1 (Coastal Plain)",null,"13.c. Wet Pond #2",null,null,"13.c. Wet Pond #2",null,"13.b. Wet Pond #1 (Coastal Plain)",null,null,null,"9.a. Sheetflow to A/B Soil Conservation Area "]
["9.b. Sheetflow to C/D Soil Conservation Area",null,"13.c. Wet Pond #2",null,"13.c. Wet Pond #2",null,"13.d. Wet Pond #2 (Coastal Plain)",null,null,"13.d. Wet Pond #2 (Coastal Plain)",null,"13.c. Wet Pond #2",null,null,null,"9.b. Sheetflow to C/D Soil Conservation Area"]
["9.c. Sheetflow to Vegetated Filter Strip",null,"13.d. Wet Pond #2 (Coastal Plain)",null,"13.d. Wet Pond #2 (Coastal Plain)",null,"14.a. MTD - Hydrodynamic",null,null,"14.a. MTD - Hydrodynamic",null,"13.d. Wet Pond #2 (Coastal Plain)",null,null,null,"9.c. Sheetflow to Vegetated Filter Strip"]
["10.a. Wet Swale #1",null,"14.a. MTD - Hydrodynamic",null,"14.a. MTD - Hydrodynamic",null,"14.b. MTD - Filtering",null,null,"14.b. MTD - Filtering",null,"14.a. MTD - Hydrodynamic",null,null,null,"10.a. Wet Swale #1"]
["10.b. Wet Swale #2",null,"14.b. MTD - Filtering",null,"14.b. MTD - Filtering",null,"14.c. MTD - Generic",null,null,"14.c. MTD - Generic",null,"14.b. MTD - Filtering",null,null,null,"10.b. Wet Swale #2"]
["11.a. Filtering Practice #1",null,"14.c. MTD - Generic",null,"14.c. MTD - Generic",null,null,null,null,null,null,"14.c. MTD - Generic",null,null,null,"11.a. Filtering Practice #1"]
["11.b. Filtering Practice #2",null,null,null,null,null,null,null,null,null,null,null,null,null,null,"11.b. Filtering Practice #2"]
["12.a. Constructed Wetland #1",null,null,null,null,null,null,null,null,null,null,null,null,null,null,"12.a. Constructed Wetland #1"]
["12.b. Constructed Wetland #2",null,null,null,null,null,null,null,null,null,null,null,null,null,null,"12.b. Constructed Wetland #2"]
["13.a. Wet Pond #1",null,null,null,null,null,null,null,null,null,null,null,null,null,null,"13.a. Wet Pond #1"]
["13.b. Wet Pond #1 (Coastal Plain)",null,null,null,null,null,null,null,null,null,null,null,null,null,null,"13.b. Wet Pond #1 (Coastal Plain)"]
["13.c. Wet Pond #2",null,null,null,null,null,null,null,null,null,null,null,null,null,null,"13.c. Wet Pond #2"]
["13.d. Wet Pond #2 (Coastal Plain)",null,null,null,null,null,null,null,null,null,null,null,null,null,null,"13.d. Wet Pond #2 (Coastal Plain)"]
["14.a. MTD - Hydrodynamic",null,null,null,null,null,null,null,null,null,null,null,null,null,null,"14.a. MTD - Hydrodynamic"]
["14.b. MTD - Filtering",null,null,null,null,null,null,null,null,null,null,null,null,null,null,"14.b. MTD - Filtering"]
["14.c. MTD - Generic",null,null,null,null,null,null,null,null,null,null,null,null,null,null,"14.c. MTD - Generic"]
[]
["Options for 5a. Dry Swale #1",null,"Options for 5b. Dry Swale #2",null,"Options for 6a. Bioretention #1",null,"Options for 6b. Bioretention #2",null,null,"Options for 7a. Infiltration #1",null,"Options for 7b. Infiltration #2"]
[]
[{"$f":"P120","v":"None"},null,{"$f":"P120","v":"None"},null,{"$f":"P120","v":"None"},null,{"$f":"P120","v":"None"},null,null,{"$f":"P120","v":"None"},null,{"$f":"P120","v":"None"}]
[{"$f":"P131","v":"4.a. Grass Channel A/B Soils"},null,{"$f":"P131","v":"4.a. Grass Channel A/B Soils"},null,{"$f":"P131","v":"4.a. Grass Channel A/B Soils"},null,{"$f":"P131","v":"4.a. Grass Channel A/B Soils"},null,null,{"$f":"P131","v":"4.a. Grass Channel A/B Soils"},null,{"$f":"P131","v":"4.a. Grass Channel A/B Soils"}]
[{"$f":"P132","v":"4.b. Grass Channel C/D Soils"},null,{"$f":"P132","v":"4.b. Grass Channel C/D Soils"},null,{"$f":"P132","v":"4.b. Grass Channel C/D Soils"},null,"4.b. Grass Channel C/D Soils",null,null,"4.b. Grass Channel C/D Soils",null,"4.b. Grass Channel C/D Soils"]
[{"$f":"P133","v":"4.c. Grass Channel Compost Amended Soils"},null,{"$f":"P133","v":"4.c. Grass Channel Compost Amended Soils"},null,{"$f":"P133","v":"4.c. Grass Channel Compost Amended Soils"},null,"4.c. Grass Channel Compost Amended Soils",null,null,"4.c. Grass Channel Compost Amended Soils",null,"4.c. Grass Channel Compost Amended Soils"]
[{"$f":"P135","v":"5.b. Dry Swale #2"},null,{"$f":"P134","v":"5.a. Dry Swale #1"},null,{"$f":"P134","v":"5.a. Dry Swale #1"},null,"5.a. Dry Swale #1",null,null,"5.a. Dry Swale #1",null,"5.a. Dry Swale #1"]
["6.a. Bioretention #1",null,{"$f":"P136","v":"6.a. Bioretention #1"},null,{"$f":"P135","v":"5.b. Dry Swale #2"},null,"5.b. Dry Swale #2",null,null,"5.b. Dry Swale #2",null,"5.b. Dry Swale #2"]
["6.b. Bioretention #2",null,"6.b. Bioretention #2",null,{"$f":"P137","v":"6.b. Bioretention #2"},null,"6.a. Bioretention #1",null,null,"6.a. Bioretention #1",null,"6.a. Bioretention #1"]
["7.a. Infiltration #1",null,"7.a. Infiltration #1",null,"7.a. Infiltration #1",null,{"$f":"P138","v":"7.a. Infiltration #1"},null,null,"6.b. Bioretention #2",null,"6.b. Bioretention #2"]
["7.b. Infiltration #2",null,"7.b. Infiltration #2",null,"7.b. Infiltration #2",null,"7.b. Infiltration #2",null,null,{"$f":"P139","v":"7.b. Infiltration #2"},null,"7.a. Infiltration #1"]
["8.a. ED #1",null,"8.a. ED #1",null,"8.a. ED #1",null,"8.a. ED #1",null,null,"8.a. ED #1",null,{"$f":"P140","v":"8.a. ED #1"}]
["8.b. ED #2",null,"8.b. ED #2",null,"8.b. ED #2",null,"8.b. ED #2",null,null,"8.b. ED #2",null,"8.b. ED #2"]
["9.a. Sheetflow to A/B Soil Conservation Area ",null,"9.a. Sheetflow to A/B Soil Conservation Area ",null,"9.a. Sheetflow to A/B Soil Conservation Area ",null,"9.a. Sheetflow to A/B Soil Conservation Area ",null,null,"9.a. Sheetflow to A/B Soil Conservation Area ",null,"9.a. Sheetflow to A/B Soil Conservation Area "]
["9.b. Sheetflow to C/D Soil Conservation Area",null,"9.b. Sheetflow to C/D Soil Conservation Area",null,"9.b. Sheetflow to C/D Soil Conservation Area",null,"9.b. Sheetflow to C/D Soil Conservation Area",null,null,"9.b. Sheetflow to C/D Soil Conservation Area",null,"9.b. Sheetflow to C/D Soil Conservation Area"]
["9.c. Sheetflow to Vegetated Filter Strip",null,"9.c. Sheetflow to Vegetated Filter Strip",null,"9.c. Sheetflow to Vegetated Filter Strip",null,"9.c. Sheetflow to Vegetated Filter Strip",null,null,"9.c. Sheetflow to Vegetated Filter Strip",null,"9.c. Sheetflow to Vegetated Filter Strip"]
["10.a. Wet Swale #1",null,"10.a. Wet Swale #1",null,"10.a. Wet Swale #1",null,"10.a. Wet Swale #1",null,null,"10.a. Wet Swale #1",null,"10.a. Wet Swale #1"]
["10.b. Wet Swale #2",null,"10.b. Wet Swale #2",null,"10.b. Wet Swale #2",null,"10.b. Wet Swale #2",null,null,"10.b. Wet Swale #2",null,"10.b. Wet Swale #2"]
["11.a. Filtering Practice #1",null,"11.a. Filtering Practice #1",null,"11.a. Filtering Practice #1",null,"11.a. Filtering Practice #1",null,null,"11.a. Filtering Practice #1",null,"11.a. Filtering Practice #1"]
["11.b. Filtering Practice #2",null,"11.b. Filtering Practice #2",null,"11.b. Filtering Practice #2",null,"11.b. Filtering Practice #2",null,null,"11.b. Filtering Practice #2",null,"11.b. Filtering Practice #2"]
["12.a. Constructed Wetland #1",null,"12.a. Constructed Wetland #1",null,"12.a. Constructed Wetland #1",null,"12.a. Constructed Wetland #1",null,null,"12.a. Constructed Wetland #1",null,"12.a. Constructed Wetland #1"]
["12.b. Constructed Wetland #2",null,"12.b. Constructed Wetland #2",null,"12.b. Constructed Wetland #2",null,"12.b. Constructed Wetland #2",null,null,"12.b. Constructed Wetland #2",null,"12.b. Constructed Wetland #2"]
["13.a. Wet Pond #1",null,"13.a. Wet Pond #1",null,"13.a. Wet Pond #1",null,"13.a. Wet Pond #1",null,null,"13.a. Wet Pond #1",null,"13.a. Wet Pond #1"]
["13.b. Wet Pond #1 (Coastal Plain)",null,"13.b. Wet Pond #1 (Coastal Plain)",null,"13.b. Wet Pond #1 (Coastal Plain)",null,"13.b. Wet Pond #1 (Coastal Plain)",null,null,"13.b. Wet Pond #1 (Coastal Plain)",null,"13.b. Wet Pond #1 (Coastal Plain)"]
["13.c. Wet Pond #2",null,"13.c. Wet Pond #2",null,"13.c. Wet Pond #2",null,"13.c. Wet Pond #2",null,null,"13.c. Wet Pond #2",null,"13.c. Wet Pond #2"]
["13.d. Wet Pond #2 (Coastal Plain)",null,"13.d. Wet Pond #2 (Coastal Plain)",null,"13.d. Wet Pond #2 (Coastal Plain)",null,"13.d. Wet Pond #2 (Coastal Plain)",null,null,"13.d. Wet Pond #2 (Coastal Plain)",null,"13.d. Wet Pond #2 (Coastal Plain)"]
["14.a. MTD - Hydrodynamic",null,"14.a. MTD - Hydrodynamic",null,"14.a. MTD - Hydrodynamic",null,"14.a. MTD - Hydrodynamic",null,null,"14.a. MTD - Hydrodynamic",null,"14.a. MTD - Hydrodynamic"]
["14.b. MTD - Filtering",null,"14.b. MTD - Filtering",null,"14.b. MTD - Filtering",null,"14.b. MTD - Filtering",null,null,"14.b. MTD - Filtering",null,"14.b. MTD - Filtering"]
["14.c. MTD - Generic",null,"14.c. MTD - Generic",null,"14.c. MTD - Generic",null,"14.c. MTD - Generic",null,null,"14.c. MTD - Generic",null,"14.c. MTD - Generic"]
[]
["Options for 8a. Extended Detention #1",null,"Options for 8b. Extended Detention #2",null,"Options for 9 Sheet Flow to Open Space",null,"Options for 9c. Sheet Flow to Filter Strip",null,null,"Options for 10a. Wet Swale #1",null,"Options for 10b. Wet Swale #2"]
[]
[{"$f":"P120","v":"None"},null,{"$f":"P120","v":"None"},null,{"$f":"P120","v":"None"},null,{"$f":"P120","v":"None"},null,null,{"$f":"P120","v":"None"},null,{"$f":"P120","v":"None"}]
[{"$f":"P131","v":"4.a. Grass Channel A/B Soils"},null,{"$f":"P131","v":"4.a. Grass Channel A/B Soils"},null,null,null,{"$f":"P131","v":"4.a. Grass Channel A/B Soils"},null,null,{"$f":"P131","v":"4.a. Grass Channel A/B Soils"},null,{"$f":"P131","v":"4.a. Grass Channel A/B Soils"}]
["4.b. Grass Channel C/D Soils",null,"4.b. Grass Channel C/D Soils",null,null,null,"4.b. Grass Channel C/D Soils",null,null,"4.b. Grass Channel C/D Soils",null,"4.b. Grass Channel C/D Soils"]
["4.c. Grass Channel Compost Amended Soils",null,"4.c. Grass Channel Compost Amended Soils",null,null,null,"4.c. Grass Channel Compost Amended Soils",null,null,"4.c. Grass Channel Compost Amended Soils",null,"4.c. Grass Channel Compost Amended Soils"]
["5.a. Dry Swale #1",null,"5.a. Dry Swale #1",null,null,null,"5.a. Dry Swale #1",null,null,"5.a. Dry Swale #1",null,"5.a. Dry Swale #1"]
["5.b. Dry Swale #2",null,"5.b. Dry Swale #2",null,null,null,"5.b. Dry Swale #2",null,null,"5.b. Dry Swale #2",null,"5.b. Dry Swale #2"]
["6.a. Bioretention #1",null,"6.a. Bioretention #1",null,null,null,"6.a. Bioretention #1",null,null,"6.a. Bioretention #1",null,"6.a. Bioretention #1"]
["6.b. Bioretention #2",null,"6.b. Bioretention #2",null,null,null,"6.b. Bioretention #2",null,null,"6.b. Bioretention #2",null,"6.b. Bioretention #2"]
["7.a. Infiltration #1",null,"7.a. Infiltration #1",null,null,null,"7.a. Infiltration #1",null,null,"7.a. Infiltration #1",null,"7.a. Infiltration #1"]
["7.b. Infiltration #2",null,"7.b. Infiltration #2",null,null,null,"7.b. Infiltration #2",null,null,"7.b. Infiltration #2",null,"7.b. Infiltration #2"]
[{"$f":"P141","v":"8.b. ED #2"},null,"8.a. ED #1",null,null,null,"8.a. ED #1",null,null,"8.a. ED #1",null,"8.a. ED #1"]
["9.a. Sheetflow to A/B Soil Conservation Area ",null,{"$f":"P142","v":"9.a. Sheetflow to A/B Soil Conservation Area "},null,null,null,"8.b. ED #2",null,null,"8.b. ED #2",null,"8.b. ED #2"]
["9.b. Sheetflow to C/D Soil Conservation Area",null,"9.b. Sheetflow to C/D Soil Conservation Area",null,null,null,"9.a. Sheetflow to A/B Soil Conservation Area ",null,null,"9.a. Sheetflow to A/B Soil Conservation Area ",null,"9.a. Sheetflow to A/B Soil Conservation Area "]
["9.c. Sheetflow to Vegetated Filter Strip",null,"9.c. Sheetflow to Vegetated Filter Strip",null,null,null,"9.b. Sheetflow to C/D Soil Conservation Area",null,null,"9.b. Sheetflow to C/D Soil Conservation Area",null,"9.b. Sheetflow to C/D Soil Conservation Area"]
["10.a. Wet Swale #1",null,"10.a. Wet Swale #1",null,null,null,{"$f":"P145","v":"10.a. Wet Swale #1"},null,null,"9.c. Sheetflow to Vegetated Filter Strip",null,"9.c. Sheetflow to Vegetated Filter Strip"]
["10.b. Wet Swale #2",null,"10.b. Wet Swale #2",null,null,null,"10.b. Wet Swale #2",null,null,{"$f":"P146","v":"10.b. Wet Swale #2"},null,"10.a. Wet Swale #1"]
["11.a. Filtering Practice #1",null,"11.a. Filtering Practice #1",null,null,null,"11.a. Filtering Practice #1",null,null,"11.a. Filtering Practice #1",null,{"$f":"P147","v":"11.a. Filtering Practice #1"}]
["11.b. Filtering Practice #2",null,"11.b. Filtering Practice #2",null,null,null,"11.b. Filtering Practice #2",null,null,"11.b. Filtering Practice #2",null,"11.b. Filtering Practice #2"]
["12.a. Constructed Wetland #1",null,"12.a. Constructed Wetland #1",null,null,null,"12.a. Constructed Wetland #1",null,null,"12.a. Constructed Wetland #1",null,"12.a. Constructed Wetland #1"]
["12.b. Constructed Wetland #2",null,"12.b. Constructed Wetland #2",null,null,null,"12.b. Constructed Wetland #2",null,null,"12.b. Constructed Wetland #2",null,"12.b. Constructed Wetland #2"]
["13.a. Wet Pond #1",null,"13.a. Wet Pond #1",null,null,null,"13.a. Wet Pond #1",null,null,"13.a. Wet Pond #1",null,"13.a. Wet Pond #1"]
["13.b. Wet Pond #1 (Coastal Plain)",null,"13.b. Wet Pond #1 (Coastal Plain)",null,null,null,"13.b. Wet Pond #1 (Coastal Plain)",null,null,"13.b. Wet Pond #1 (Coastal Plain)",null,"13.b. Wet Pond #1 (Coastal Plain)"]
["13.c. Wet Pond #2",null,"13.c. Wet Pond #2",null,null,null,"13.c. Wet Pond #2",null,null,"13.c. Wet Pond #2",null,"13.c. Wet Pond #2"]
["13.d. Wet Pond #2 (Coastal Plain)",null,"13.d. Wet Pond #2 (Coastal Plain)",null,null,null,"13.d. Wet Pond #2 (Coastal Plain)",null,null,"13.d. Wet Pond #2 (Coastal Plain)",null,"13.d. Wet Pond #2 (Coastal Plain)"]
["14.a. MTD - Hydrodynamic",null,"14.a. MTD - Hydrodynamic",null,null,null,"14.a. MTD - Hydrodynamic",null,null,"14.a. MTD - Hydrodynamic",null,"14.a. MTD - Hydrodynamic"]
["14.b. MTD - Filtering",null,"14.b. MTD - Filtering",null,null,null,"14.b. MTD - Filtering",null,null,"14.b. MTD - Filtering",null,"14.b. MTD - Filtering"]
["14.c. MTD - Generic",null,"14.c. MTD - Generic",null,null,null,"14.c. MTD - Generic",null,null,"14.c. MTD - Generic",null,"14.c. MTD - Generic"]
[]
[null,null,null,null,"Options for 12.a.  Constructed Wetland #1",null,"Options for 12.b.  Constructed Wetland #2"]
["Options for 11 A.  Filtering Practice #1",null,"Options for 11 b.  Filtering Practice #2",null,null,null,null,null,null,"Options for 13.a.  Wet Pond #1"]
[null,null,null,null,{"$f":"P120","v":"None"},null,{"$f":"P120","v":"None"},null,null,{"$f":"P120","v":"None"},null,"Options for 13.b.  Wet Pond #1 (Coastal Plain)"]
[{"$f":"P120","v":"None"},null,{"$f":"P120","v":"None"},null,{"$f":"P131","v":"4.a. Grass Channel A/B Soils"},null,{"$f":"P131","v":"4.a. Grass Channel A/B Soils"},null,null,{"$f":"P131","v":"4.a. Grass Channel A/B Soils"},null,{"$f":"P120","v":"None"}]
[{"$f":"P131","v":"4.a. Grass Channel A/B Soils"},null,{"$f":"P131","v":"4.a. Grass Channel A/B Soils"},null,"4.b. Grass Channel C/D Soils",null,"4.b. Grass Channel C/D Soils",null,null,"4.b. Grass Channel C/D Soils",null,{"$f":"P131","v":"4.a. Grass Channel A/B Soils"}]
["4.b. Grass Channel C/D Soils",null,"4.b. Grass Channel C/D Soils",null,"4.c. Grass Channel Compost Amended Soils",null,"4.c. Grass Channel Compost Amended Soils",null,null,"4.c. Grass Channel Compost Amended Soils",null,"4.b. Grass Channel C/D Soils"]
["4.c. Grass Channel Compost Amended Soils",null,"4.c. Grass Channel Compost Amended Soils",null,"5.a. Dry Swale #1",null,"5.a. Dry Swale #1",null,null,"5.a. Dry Swale #1",null,"4.c. Grass Channel Compost Amended Soils"]
["5.a. Dry Swale #1",null,"5.a. Dry Swale #1",null,"5.b. Dry Swale #2",null,"5.b. Dry Swale #2",null,null,"5.b. Dry Swale #2",null,"5.a. Dry Swale #1"]
["5.b. Dry Swale #2",null,"5.b. Dry Swale #2",null,"6.a. Bioretention #1",null,"6.a. Bioretention #1",null,null,"6.a. Bioretention #1",null,"5.b. Dry Swale #2"]
["6.a. Bioretention #1",null,"6.a. Bioretention #1",null,"6.b. Bioretention #2",null,"6.b. Bioretention #2",null,null,"6.b. Bioretention #2",null,"6.a. Bioretention #1"]
["6.b. Bioretention #2",null,"6.b. Bioretention #2",null,"7.a. Infiltration #1",null,"7.a. Infiltration #1",null,null,"7.a. Infiltration #1",null,"6.b. Bioretention #2"]
["7.a. Infiltration #1",null,"7.a. Infiltration #1",null,"7.b. Infiltration #2",null,"7.b. Infiltration #2",null,null,"7.b. Infiltration #2",null,"7.a. Infiltration #1"]
["7.b. Infiltration #2",null,"7.b. Infiltration #2",null,"8.a. ED #1",null,"8.a. ED #1",null,null,"8.a. ED #1",null,"7.b. Infiltration #2"]
["8.a. ED #1",null,"8.a. ED #1",null,"8.b. ED #2",null,"8.b. ED #2",null,null,"8.b. ED #2",null,"8.a. ED #1"]
["8.b. ED #2",null,"8.b. ED #2",null,"9.a. Sheetflow to A/B Soil Conservation Area ",null,"9.a. Sheetflow to A/B Soil Conservation Area ",null,null,"9.a. Sheetflow to A/B Soil Conservation Area ",null,"8.b. ED #2"]
["9.a. Sheetflow to A/B Soil Conservation Area ",null,"9.a. Sheetflow to A/B Soil Conservation Area ",null,"9.b. Sheetflow to C/D Soil Conservation Area",null,"9.b. Sheetflow to C/D Soil Conservation Area",null,null,"9.b. Sheetflow to C/D Soil Conservation Area",null,"9.a. Sheetflow to A/B Soil Conservation Area "]
["9.b. Sheetflow to C/D Soil Conservation Area",null,"9.b. Sheetflow to C/D Soil Conservation Area",null,"9.c. Sheetflow to Vegetated Filter Strip",null,"9.c. Sheetflow to Vegetated Filter Strip",null,null,"9.c. Sheetflow to Vegetated Filter Strip",null,"9.b. Sheetflow to C/D Soil Conservation Area"]
["9.c. Sheetflow to Vegetated Filter Strip",null,"9.c. Sheetflow to Vegetated Filter Strip",null,"10.a. Wet Swale #1",null,"10.a. Wet Swale #1",null,null,"10.a. Wet Swale #1",null,"9.c. Sheetflow to Vegetated Filter Strip"]
["10.a. Wet Swale #1",null,"10.a. Wet Swale #1",null,"10.b. Wet Swale #2",null,"10.b. Wet Swale #2",null,null,"10.b. Wet Swale #2",null,"10.a. Wet Swale #1"]
["10.b. Wet Swale #2",null,"10.b. Wet Swale #2",null,"11.a. Filtering Practice #1",null,"11.a. Filtering Practice #1",null,null,"11.a. Filtering Practice #1",null,"10.b. Wet Swale #2"]
[{"$f":"P148","v":"11.b. Filtering Practice #2"},null,"11.a. Filtering Practice #1",null,"11.b. Filtering Practice #2",null,"11.b. Filtering Practice #2",null,null,"11.b. Filtering Practice #2",null,"11.a. Filtering Practice #1"]
["12.a. Constructed Wetland #1",null,{"$f":"P149","v":"12.a. Constructed Wetland #1"},null,{"$f":"P150","v":"12.b. Constructed Wetland #2"},null,"12.a. Constructed Wetland #1",null,null,"12.a. Constructed Wetland #1",null,"11.b. Filtering Practice #2"]
["12.b. Constructed Wetland #2",null,"12.b. Constructed Wetland #2",null,"13.a. Wet Pond #1",null,{"$f":"P151","v":"13.a. Wet Pond #1"},null,null,"12.b. Constructed Wetland #2",null,"12.a. Constructed Wetland #1"]
["13.a. Wet Pond #1",null,"13.a. Wet Pond #1",null,"13.b. Wet Pond #1 (Coastal Plain)",null,"13.b. Wet Pond #1 (Coastal Plain)",null,null,{"$f":"P153","v":"13.c. Wet Pond #2"},null,"12.b. Constructed Wetland #2"]
["13.b. Wet Pond #1 (Coastal Plain)",null,"13.b. Wet Pond #1 (Coastal Plain)",null,"13.c. Wet Pond #2",null,"13.c. Wet Pond #2",null,null,{"$f":"P155","v":"14.a. MTD - Hydrodynamic"},null,{"$f":"P154","v":"13.d. Wet Pond #2 (Coastal Plain)"}]
["13.c. Wet Pond #2",null,"13.c. Wet Pond #2",null,"13.d. Wet Pond #2 (Coastal Plain)",null,"13.d. Wet Pond #2 (Coastal Plain)",null,null,{"$f":"P156","v":"14.b. MTD - Filtering"},null,{"$f":"P155","v":"14.a. MTD - Hydrodynamic"}]
["13.d. Wet Pond #2 (Coastal Plain)",null,"13.d. Wet Pond #2 (Coastal Plain)",null,"14.a. MTD - Hydrodynamic",null,"14.a. MTD - Hydrodynamic",null,null,{"$f":"P157","v":"14.c. MTD - Generic"},null,{"$f":"P156","v":"14.b. MTD - Filtering"}]
["14.a. MTD - Hydrodynamic",null,"14.a. MTD - Hydrodynamic",null,"14.b. MTD - Filtering",null,"14.b. MTD - Filtering",null,null,null,null,{"$f":"P157","v":"14.c. MTD - Generic"}]
["14.b. MTD - Filtering",null,"14.b. MTD - Filtering",null,"14.c. MTD - Generic",null,"14.c. MTD - Generic"]
["14.c. MTD - Generic",null,"14.c. MTD - Generic"]
[]
[]
["Options for 13.c.  Wet Pond #2",null,"Options for 13.d.  Wet Pond #2 (Coastal Plain)",null,"Options for 14.a.  Manufactured Device-Hydrodynamic",null,"Options for 14.b.  Manufactured Device-Filtering",null,null,null,"Options for 14.c.  Manufactured Device-Generic"]
[]
[{"$f":"P120","v":"None"},null,{"$f":"P120","v":"None"},null,{"$f":"P120","v":"None"},null,{"$f":"P120","v":"None"},null,null,null,{"$f":"P120","v":"None"}]
[{"$f":"P131","v":"4.a. Grass Channel A/B Soils"},null,{"$f":"P131","v":"4.a. Grass Channel A/B Soils"},null,{"$f":"P131","v":"4.a. Grass Channel A/B Soils"},null,{"$f":"P131","v":"4.a. Grass Channel A/B Soils"},null,null,null,{"$f":"P131","v":"4.a. Grass Channel A/B Soils"}]
["4.b. Grass Channel C/D Soils",null,"4.b. Grass Channel C/D Soils",null,"4.b. Grass Channel C/D Soils",null,"4.b. Grass Channel C/D Soils",null,null,null,"4.b. Grass Channel C/D Soils"]
["4.c. Grass Channel Compost Amended Soils",null,"4.c. Grass Channel Compost Amended Soils",null,"4.c. Grass Channel Compost Amended Soils",null,"4.c. Grass Channel Compost Amended Soils",null,null,null,"4.c. Grass Channel Compost Amended Soils"]
["5.a. Dry Swale #1",null,"5.a. Dry Swale #1",null,"5.a. Dry Swale #1",null,"5.a. Dry Swale #1",null,null,null,"5.a. Dry Swale #1"]
["5.b. Dry Swale #2",null,"5.b. Dry Swale #2",null,"5.b. Dry Swale #2",null,"5.b. Dry Swale #2",null,null,null,"5.b. Dry Swale #2"]
["6.a. Bioretention #1",null,"6.a. Bioretention #1",null,"6.a. Bioretention #1",null,"6.a. Bioretention #1",null,null,null,"6.a. Bioretention #1"]
["6.b. Bioretention #2",null,"6.b. Bioretention #2",null,"6.b. Bioretention #2",null,"6.b. Bioretention #2",null,null,null,"6.b. Bioretention #2"]
["7.a. Infiltration #1",null,"7.a. Infiltration #1",null,"7.a. Infiltration #1",null,"7.a. Infiltration #1",null,null,null,"7.a. Infiltration #1"]
["7.b. Infiltration #2",null,"7.b. Infiltration #2",null,"7.b. Infiltration #2",null,"7.b. Infiltration #2",null,null,null,"7.b. Infiltration #2"]
["8.a. ED #1",null,"8.a. ED #1",null,"8.a. ED #1",null,"8.a. ED #1",null,null,null,"8.a. ED #1"]
["8.b. ED #2",null,"8.b. ED #2",null,"8.b. ED #2",null,"8.b. ED #2",null,null,null,"8.b. ED #2"]
["9.a. Sheetflow to A/B Soil Conservation Area ",null,"9.a. Sheetflow to A/B Soil Conservation Area ",null,"9.a. Sheetflow to A/B Soil Conservation Area ",null,"9.a. Sheetflow to A/B Soil Conservation Area ",null,null,null,"9.a. Sheetflow to A/B Soil Conservation Area "]
["9.b. Sheetflow to C/D Soil Conservation Area",null,"9.b. Sheetflow to C/D Soil Conservation Area",null,"9.b. Sheetflow to C/D Soil Conservation Area",null,"9.b. Sheetflow to C/D Soil Conservation Area",null,null,null,"9.b. Sheetflow to C/D Soil Conservation Area"]
["9.c. Sheetflow to Vegetated Filter Strip",null,"9.c. Sheetflow to Vegetated Filter Strip",null,"9.c. Sheetflow to Vegetated Filter Strip",null,"9.c. Sheetflow to Vegetated Filter Strip",null,null,null,"9.c. Sheetflow to Vegetated Filter Strip"]
["10.a. Wet Swale #1",null,"10.a. Wet Swale #1",null,"10.a. Wet Swale #1",null,"10.a. Wet Swale #1",null,null,null,"10.a. Wet Swale #1"]
["10.b. Wet Swale #2",null,"10.b. Wet Swale #2",null,"10.b. Wet Swale #2",null,"10.b. Wet Swale #2",null,null,null,"10.b. Wet Swale #2"]
["11.a. Filtering Practice #1",null,"11.a. Filtering Practice #1",null,"11.a. Filtering Practice #1",null,"11.a. Filtering Practice #1",null,null,null,"11.a. Filtering Practice #1"]
["11.b. Filtering Practice #2",null,"11.b. Filtering Practice #2",null,"11.b. Filtering Practice #2",null,"11.b. Filtering Practice #2",null,null,null,"11.b. Filtering Practice #2"]
["12.a. Constructed Wetland #1",null,"12.a. Constructed Wetland #1",null,"12.a. Constructed Wetland #1",null,"12.a. Constructed Wetland #1",null,null,null,"12.a. Constructed Wetland #1"]
["12.b. Constructed Wetland #2",null,"12.b. Constructed Wetland #2",null,"12.b. Constructed Wetland #2",null,"12.b. Constructed Wetland #2",null,null,null,"12.b. Constructed Wetland #2"]
["13.a. Wet Pond #1",null,{"$f":"P152","v":"13.b. Wet Pond #1 (Coastal Plain)"},null,"13.a. Wet Pond #1",null,"13.a. Wet Pond #1",null,null,null,"13.a. Wet Pond #1"]
[{"$f":"P155","v":"14.a. MTD - Hydrodynamic"},null,{"$f":"P155","v":"14.a. MTD - Hydrodynamic"},null,"13.b. Wet Pond #1 (Coastal Plain)",null,"13.b. Wet Pond #1 (Coastal Plain)",null,null,null,"13.b. Wet Pond #1 (Coastal Plain)"]
[{"$f":"P156","v":"14.b. MTD - Filtering"},null,{"$f":"P156","v":"14.b. MTD - Filtering"},null,"13.c. Wet Pond #2",null,"13.c. Wet Pond #2",null,null,null,"13.c. Wet Pond #2"]
[{"$f":"P157","v":"14.c. MTD - Generic"},null,{"$f":"P157","v":"14.c. MTD - Generic"},null,"13.d. Wet Pond #2 (Coastal Plain)",null,"13.d. Wet Pond #2 (Coastal Plain)",null,null,null,"13.d. Wet Pond #2 (Coastal Plain)"]
[null,null,null,null,{"$f":"P156","v":"14.b. MTD - Filtering"}]

{"sheet":"D.A. D","index":4,"n_rows":278,"n_cols":27,"rows_kept":278,"cut":false,"hidden":false,"merged":[[13,13,13,14],[0,3,0,4],[6,8,6,11],[7,8,7,11],[10,13,10,14],[12,13,12,14],[31,13,31,14],[16,13,16,14],[17,13,17,14],[18,13,18,14],[19,13,19,14],[20,13,20,14],[21,13,21,14],[22,13,22,14],[23,13,23,14],[24,13,24,14],[27,13,27,14],[28,13,28,14],[54,13,54,14],[51,16,51,19],[52,13,52,14],[32,13,32,14],[33,13,33,14],[36,13,36,14],[37,13,37,14],[40,13,40,14],[41,13,41,14],[44,13,44,14],[45,13,45,14],[48,13,48,14],[49,13,49,14],[53,13,53,14],[69,1,69,2],[69,15,69,16],[70,17,70,19],[88,0,88,1],[88,17,88,19],[72,13,72,14],[74,16,74,18],[75,13,75,14],[76,13,76,14],[79,13,79,14],[80,13,80,14],[71,13,71,14],[89,13,89,14],[90,13,90,14],[91,13,91,14],[82,16,82,17],[83,13,83,14],[84,13,84,14],[85,13,85,14],[86,13,86,14]]}
["Drainage Area D"]
[null,null,null,null,null,null,null,null,null,null,null,null,null,null,null,null,null,null,null,null,null,null,null,null,"Check Areas!",null,"CHECK AREAS!"]
["Drainage Area A Land Cover  (acres)",{"$f":"IF($F$8>Site!$F$27,\"Drainage area is greater than site area!\",(IF(OR(F5>Site!F24,F6>Site!F25,F7>Site!F26),\"Check Site Tab land cover areas!\",\"\")))","v":""}]
[null,"A Soils","B Soils","C Soils","D Soils","Totals","Land Cover Rv",null,null,null,null,null,null,"`"]
["Forest/Open Space (acres)",null,null,null,null,{"$f":"SUMIF(B5:E5,\">=0\")","v":0},{"$f":"IF(F5>0,(B5*Site!E32+C5*Site!F32+D5*Site!G32+E5*Site!H32)/F5,0)","v":0}]
["Managed Turf (acres)",null,null,null,null,{"$f":"SUMIF(B6:E6,\">=0\")","v":0},{"$f":"IF(F6>0,(B6*Site!E33+C6*Site!F33+D6*Site!G33+E6*Site!H33)/F6,0)","v":0}]
["Impervious Cover (acres) ",null,null,null,null,{"$f":"SUMIF(B7:E7,\">=0\")","v":0},{"$f":"IF(F7>0,((B7*Site!E34+C7*Site!F34+D7*Site!G34+E7*Site!H34)/F7),0)","v":0},null,"     Total Phosphorus Available for Removal in D.A. D (lb/yr)",null,null,null,{"$f":"Site!$B$31*Site!$B$36*($M$8/Site!$B$32)*Site!$B$33*2.72/43560","v":0}]
[null,null,null,null,"Total",{"$f":"SUM(F5:F7)","v":0},null,null,"Post Development Treatment Volume in D.A. D (ft3)",null,null,null,{"$f":"IFERROR(Site!B32/12*(F6*G6+F7*G7)/(F6+F7)*(F6+F7)*43560,0)","v":0}]
[]
["Stormwater Best Management Practices (RR = Runoff Reduction)",null,null,null,null,null,null,null,null,null,null,null,null,"--Select from dropdown lists--"]
["Practice","Runoff Reduction Credit (%)","Managed Turf Credit Area (acres) ","Impervious Cover Credit Area (acres)","Volume from Upstream Practice (ft3)","Runoff Reduction (ft3)","Remaining Runoff Volume  (ft3)","Total BMP Treatment Volume (ft3)","Phosphorus Removal Efficiency (%)","Phosphorus Load from Upstream Practices (lb)","Untreated Phosphorus Load to Practice (lb)","Phosphorus Removed By Practice (lb)","Remaining Phosphorus Load (lb)","Downstream Practice to be Employed",null,null,"Nitrogen Removal Efficiency (%)","Nitrogen Load from Upstream  Practices (lbs)","Untreated Nitrogen Load to Practice (lbs)","Nitrogen Removed By Practice (lbs)","Remaining Nitrogen Load (lbs)"]
["1. Vegetated Roof (RR)",null,null,null,null,null,null,null,null,null,null,null,null,null,null,null,"1. Vegetated Roof (RR)"]
["1.a. Vegetated Roof #1 (Spec #5)",45,null,null,null,{"$f":"(Site!$B$32*($G$7*$D13)*3630)*$B13/100","v":0},{"$f":"(Site!$B$32*($G$7*$D13)*3630)*(1-$B13/100)","v":0},{"$f":"+$F13+$G13","v":0},0,null,{"$f":"(Site!$B$32*($G$7*$D13)*3630)*Site!$B$33*0.3048^3/454*Site!$B$31/Site!$B$32*Site!$B$36","v":0},{"$f":"IFERROR($K13*($F13+$G13*$I13/100)/($H13),0)","v":0},{"$f":"$K13-$L13","v":0},null,null,null,0,null,{"$f":"(Site!$B$32*$G$7*$D13*3630)*Site!$B$34*0.3048^3/454*Site!$B$31/Site!$B$32*Site!$B$36","v":0},{"$f":"IFERROR($S13*($F13+$G13*$Q13/100)/$H13,0)","v":0},{"$f":"$S13-$T13","v":0}]
["1.b. Vegetated Roof #2 (Spec #5)",60,null,null,null,{"$f":"(Site!$B$32*($G$7*$D14)*3630)*$B14/100","v":0},{"$f":"(Site!$B$32*($G$7*$D14)*3630)*(1-$B14/100)","v":0},{"$f":"+$F14+$G14","v":0},0,null,{"$f":"(Site!$B$32*($G$7*$D14)*3630)*Site!$B$33*0.3048^3/454*Site!$B$31/Site!$B$32*Site!$B$36","v":0},{"$f":"IFERROR($K14*($F14+$G14*$I14/100)/($H14),0)","v":0},{"$f":"$K14-$L14","v":0},null,null,null,0,null,{"$f":"(Site!$B$32*$G$7*$D14*3630)*Site!$B$34*0.3048^3/454*Site!$B$31/Site!$B$32*Site!$B$36","v":0},{"$f":"IFERROR($S14*($F14+$G14*$Q14/100)/$H14,0)","v":0},{"$f":"$S14-$T14","v":0}]
[]
["2. Rooftop Disconnection (RR)",null,null,null,null,null,null,null,null,null,null,null,null,null,null,null,"2. Rooftop Disconnection (RR)"]
["2.a. Simple Disconnection to A/B Soils \n(Spec #1)",50,null,null,{"$f":"SUMIF($N$13:$N$92,$P121,$G$13:$G$92)","v":0},{"$f":"(Site!$B$32*($G$6*$C17+$G$7*$D17)*3630+$E17)*$B17/100","v":0},{"$f":"(Site!$B$32*($G$6*$C17+$G$7*$D17)*3630+$E17)*(1-$B17/100)","v":0},{"$f":"+$F17+$G17","v":0},0,{"$f":"SUMIF($N$13:$N$92,$P121,$M$13:$M$92)","v":0},{"$f":"(Site!$B$32*($G$6*$C17+$G$7*$D17)*3630)*Site!$B$33*0.3048^3/454*Site!$B$31/Site!$B$32*Site!$B$36","v":0},{"$f":"IFERROR(($J17+$K17)*($F17+$G17*$I17/100)/$H17,0)","v":0},{"$f":"$J17+$K17-$L17","v":0},null,null,null,0,{"$f":"SUMIF($N$13:$N$92,$P121,$U$13:$U$92)","v":0},{"$f":"(Site!$B$32*$G$7*$D17*3630)*Site!$B$34*0.3048^3/454*Site!$B$31/Site!$B$32*Site!$B$36","v":0},{"$f":"IFERROR(($R17+$S17)*($F17+$G17*$Q17/100)/$H17,0)","v":0},{"$f":"$R17+$S17-$T17","v":0}]
["2.b. Simple Disconnection to C/D Soils \n(Spec #1)",25,null,null,{"$f":"SUMIF($N$13:$N$92,$P122,$G$13:$G$92)","v":0},{"$f":"(Site!$B$32*($G$6*$C18+$G$7*$D18)*3630+$E18)*$B18/100","v":0},{"$f":"(Site!$B$32*($G$6*$C18+$G$7*$D18)*3630+$E18)*(1-$B18/100)","v":0},{"$f":"+$F18+$G18","v":0},0,{"$f":"SUMIF($N$13:$N$92,$P122,$M$13:$M$92)","v":0},{"$f":"(Site!$B$32*($G$6*$C18+$G$7*$D18)*3630)*Site!$B$33*0.3048^3/454*Site!$B$31/Site!$B$32*Site!$B$36","v":0},{"$f":"IFERROR(($J18+$K18)*($F18+$G18*$I18/100)/$H18,0)","v":0},0,null,null,null,0,{"$f":"SUMIF($N$13:$N$92,$P122,$U$13:$U$92)","v":0},{"$f":"(Site!$B$32*$G$7*$D18*3630)*Site!$B$34*0.3048^3/454*Site!$B$31/Site!$B$32*Site!$B$36","v":0},{"$f":"IFERROR(($R18+$S18)*($F18+$G18*$Q18/100)/$H18,0)","v":0},0]
["2.c. To Soil Amended Filter Path as per specifications (existing C/D soils) (Spec #4)",50,null,null,0,{"$f":"(Site!$B$32*($G$6*$C19+$G$7*$D19)*3630+$E19)*$B19/100","v":0},{"$f":"(Site!$B$32*($G$6*$C19+$G$7*$D19)*3630+$E19)*(1-$B19/100)","v":0},0,0,0,{"$f":"(Site!$B$32*($G$6*$C19+$G$7*$D19)*3630)*Site!$B$33*0.3048^3/454*Site!$B$31/Site!$B$32*Site!$B$36","v":0},0,0,null,null,null,0,0,{"$f":"(Site!$B$32*$G$7*$D19*3630)*Site!$B$34*0.3048^3/454*Site!$B$31/Site!$B$32*Site!$B$36","v":0},0,0]
["2.d. To Dry Well or French Drain #1, \nMicro-Infilration #1 (Spec #8)",50,null,null,0,{"$f":"(Site!$B$32*($G$6*$C20+$G$7*$D20)*3630+$E20)*$B20/100","v":0},{"$f":"(Site!$B$32*($G$6*$C20+$G$7*$D20)*3630+$E20)*(1-$B20/100)","v":0},0,25,0,{"$f":"(Site!$B$32*($G$6*$C20+$G$7*$D20)*3630)*Site!$B$33*0.3048^3/454*Site!$B$31/Site!$B$32*Site!$B$36","v":0},0,0,null,null,null,15,0,{"$f":"(Site!$B$32*$G$7*$D20*3630)*Site!$B$34*0.3048^3/454*Site!$B$31/Site!$B$32*Site!$B$36","v":0},0,0]
["2.e. To Dry Well or French Drain #2, \nMicro-Infiltration #2 (Spec #8)",90,null,null,0,{"$f":"(Site!$B$32*($G$6*$C21+$G$7*$D21)*3630+$E21)*$B21/100","v":0},{"$f":"(Site!$B$32*($G$6*$C21+$G$7*$D21)*3630+$E21)*(1-$B21/100)","v":0},0,25,0,{"$f":"(Site!$B$32*($G$6*$C21+$G$7*$D21)*3630)*Site!$B$33*0.3048^3/454*Site!$B$31/Site!$B$32*Site!$B$36","v":0},0,0,null,null,null,15,0,{"$f":"(Site!$B$32*$G$7*$D21*3630)*Site!$B$34*0.3048^3/454*Site!$B$31/Site!$B$32*Site!$B$36","v":0},0,0]
["2.f. To Rain Garden #1, \nMicro-Bioretention #1 (Spec #9)",40,null,null,0,{"$f":"(Site!$B$32*($G$6*$C22+$G$7*$D22)*3630+$E22)*$B22/100","v":0},{"$f":"(Site!$B$32*($G$6*$C22+$G$7*$D22)*3630+$E22)*(1-$B22/100)","v":0},0,25,0,{"$f":"(Site!$B$32*($G$6*$C22+$G$7*$D22)*3630)*Site!$B$33*0.3048^3/454*Site!$B$31/Site!$B$32*Site!$B$36","v":0},0,0,null,null,null,40,0,{"$f":"(Site!$B$32*$G$7*$D22*3630)*Site!$B$34*0.3048^3/454*Site!$B$31/Site!$B$32*Site!$B$36","v":0},0,0]
["2.g. To Rain Garden #2, \nMicro-Bioretention #2 (Spec #9)",80,null,null,0,{"$f":"(Site!$B$32*($G$6*$C23+$G$7*$D23)*3630+$E23)*$B23/100","v":0},{"$f":"(Site!$B$32*($G$6*$C23+$G$7*$D23)*3630+$E23)*(1-$B23/100)","v":0},0,50,0,{"$f":"(Site!$B$32*($G$6*$C23+$G$7*$D23)*3630)*Site!$B$33*0.3048^3/454*Site!$B$31/Site!$B$32*Site!$B$36","v":0},0,0,null,null,null,60,0,{"$f":"(Site!$B$32*$G$7*$D23*3630)*Site!$B$34*0.3048^3/454*Site!$B$31/Site!$B$32*Site!$B$36","v":0},0,0]
["2.h. To Rainwater Harvesting (Spec #6)",0,null,null,0,{"$f":"(Site!$B$32*($G$6*$C24+$G$7*$D24)*3630+$E24)*$B24/100","v":0},{"$f":"(Site!$B$32*($G$6*$C24+$G$7*$D24)*3630+$E24)*(1-$B24/100)","v":0},0,0,0,{"$f":"(Site!$B$32*($G$6*$C24+$G$7*$D24)*3630)*Site!$B$33*0.3048^3/454*Site!$B$31/Site!$B$32*Site!$B$36","v":0},0,0,null,null,null,0,0,{"$f":"(Site!$B$32*$G$7*$D24*3630)*Site!$B$34*0.3048^3/454*Site!$B$31/Site!$B$32*Site!$B$36","v":0},0,0]
["2.i. To Stormwater Planter, \nUrban Bioretention (Spec #9, Appendix A)",40,null,null,0,{"$f":"(Site!$B$32*($G$6*$C25+$G$7*$D25)*3630+$E25)*$B25/100","v":0},{"$f":"(Site!$B$32*($G$6*$C25+$G$7*$D25)*3630+$E25)*(1-$B25/100)","v":0},0,25,0,{"$f":"(Site!$B$32*($G$6*$C25+$G$7*$D25)*3630)*Site!$B$33*0.3048^3/454*Site!$B$31/Site!$B$32*Site!$B$36","v":0},0,0,null,null,null,40,0,{"$f":"(Site!$B$32*$G$7*$D25*3630)*Site!$B$34*0.3048^3/454*Site!$B$31/Site!$B$32*Site!$B$36","v":0},0,0]
[]
["3. Permeable Pavement  (RR)",null,null,null,null,null,null,null,null,null,null,null,null,null,null,null,"3. Permeable Pavement  (RR)"]
["3.a. Permeable Pavement #1 (Spec #7)",45,null,null,{"$f":"SUMIF($N$13:$N$92,$P130,$G$13:$G$92)","v":0},{"$f":"(Site!$B$32*($G$6*$C28+$G$7*$D28)*3630+$E28)*$B28/100","v":0},{"$f":"(Site!$B$32*($G$6*$C28+$G$7*$D28)*3630+$E28)*(1-$B28/100)","v":0},{"$f":"+$F28+$G28","v":0},25,{"$f":"SUMIF($N$13:$N$92,$P130,$M$13:$M$92)","v":0},{"$f":"(Site!$B$32*($G$6*$C28+$G$7*$D28)*3630)*Site!$B$33*0.3048^3/454*Site!$B$31/Site!$B$32*Site!$B$36","v":0},{"$f":"IFERROR(($J28+$K28)*($F28+$G28*$I28/100)/$H28,0)","v":0},{"$f":"$J28+$K28-$L28","v":0},null,null,null,25,{"$f":"SUMIF($N$13:$N$92,$P130,$U$13:$U$92)","v":0},{"$f":"(Site!$B$32*($G$6*$C28+$G$7*$D28)*3630)*Site!$B$34*0.3048^3/454*Site!$B$31/Site!$B$32*Site!$B$36","v":0},{"$f":"IFERROR(($R28+$S28)*($F28+$G28*$Q28/100)/$H28,0)","v":0},{"$f":"$R28+$S28-$T28","v":0}]
["3.b. Permeable Pavement #2 (Spec #7)",75,null,null,null,{"$f":"(Site!$B$32*($G$6*$C29+$G$7*$D29)*3630+$E29)*$B29/100","v":0},{"$f":"(Site!$B$32*($G$6*$C29+$G$7*$D29)*3630+$E29)*(1-$B29/100)","v":0},{"$f":"+$F29+$G29","v":0},25,null,{"$f":"(Site!$B$32*($G$6*$C29+$G$7*$D29)*3630)*Site!$B$33*0.3048^3/454*Site!$B$31/Site!$B$32*Site!$B$36","v":0},{"$f":"IFERROR(($J29+$K29)*($F29+$G29*$I29/100)/$H29,0)","v":0},{"$f":"$K29-$L29","v":0},null,null,null,25,null,{"$f":"(Site!$B$32*$G$7*$D29*3630)*Site!$B$34*0.3048^3/454*Site!$B$31/Site!$B$32*Site!$B$36","v":0},{"$f":"IFERROR(($R29+$S29)*($F29+$G29*$Q29/100)/$H29,0)","v":0},{"$f":"$R29+$S29-$T29","v":0}]
[]
["4. Grass Channel (RR)",null,null,null,null,null,null,null,null,null,null,null,null,null,null,null,"4. Grass Channel (RR)"]
["4.a. Grass Channel A/B Soils (Spec #3)",20,null,null,{"$f":"SUMIF($N$13:$N$92,$P131,$G$13:$G$92)","v":0},{"$f":"(Site!$B$32*($G$6*$C32+$G$7*$D32)*3630+$E32)*$B32/100","v":0},{"$f":"(Site!$B$32*($G$6*$C32+$G$7*$D32)*3630+$E32)*(1-$B32/100)","v":0},{"$f":"+$F32+$G32","v":0},15,{"$f":"SUMIF($N$13:$N$92,$P131,$M$13:$M$92)","v":0},{"$f":"(Site!$B$32*($G$6*$C32+$G$7*$D32)*3630)*Site!$B$33*0.3048^3/454*Site!$B$31/Site!$B$32*Site!$B$36","v":0},{"$f":"IFERROR(($J32+$K32)*($F32+$G32*$I32/100)/$H32,0)","v":0},{"$f":"$J32+$K32-$L32","v":0},null,null,null,20,{"$f":"SUMIF($N$13:$N$92,$P131,$U$13:$U$92)","v":0},{"$f":"(Site!$B$32*($G$6*$C32+$G$7*$D32)*3630)*Site!$B$34*0.3048^3/454*Site!$B$31/Site!$B$32*Site!$B$36","v":0},{"$f":"IFERROR(($R32+$S32)*($F32+$G32*$Q32/100)/$H32,0)","v":0},{"$f":"$R32+$S32-$T32","v":0}]
["4.b. Grass Channel C/D Soils (Spec #3)",10,null,null,{"$f":"SUMIF($N$13:$N$92,$P132,$G$13:$G$92)","v":0},{"$f":"(Site!$B$32*($G$6*$C33+$G$7*$D33)*3630+$E33)*$B33/100","v":0},{"$f":"(Site!$B$32*($G$6*$C33+$G$7*$D33)*3630+$E33)*(1-$B33/100)","v":0},{"$f":"+$F33+$G33","v":0},15,{"$f":"SUMIF($N$13:$N$92,$P132,$M$13:$M$92)","v":0},{"$f":"(Site!$B$32*($G$6*$C33+$G$7*$D33)*3630)*Site!$B$33*0.3048^3/454*Site!$B$31/Site!$B$32*Site!$B$36","v":0},{"$f":"IFERROR(($J33+$K33)*($F33+$G33*$I33/100)/$H33,0)","v":0},{"$f":"$J33+$K33-$L33","v":0},null,null,null,20,{"$f":"SUMIF($N$13:$N$92,$P132,$U$13:$U$92)","v":0},{"$f":"(Site!$B$32*($G$6*$C33+$G$7*$D33)*3630)*Site!$B$34*0.3048^3/454*Site!$B$31/Site!$B$32*Site!$B$36","v":0},{"$f":"IFERROR(($R33+$S33)*($F33+$G33*$Q33/100)/$H33,0)","v":0},{"$f":"$R33+$S33-$T33","v":0}]
["4.c. Grass Channel with Compost Amended Soils as per specs (see Spec #4)",{"$f":"IF(Site!$J$11=\"2011 Stds & Specs\",30,20)","v":20},null,null,0,{"$f":"(Site!$B$32*($G$6*$C34+$G$7*$D34)*3630+$E34)*$B34/100","v":0},{"$f":"(Site!$B$32*($G$6*$C34+$G$7*$D34)*3630+$E34)*(1-$B34/100)","v":0},0,15,{"$f":"SUMIF($N$13:$N$92,$P133,$M$13:$M$92)","v":0},{"$f":"(Site!$B$32*($G$6*$C34+$G$7*$D34)*3630)*Site!$B$33*0.3048^3/454*Site!$B$31/Site!$B$32*Site!$B$36","v":0},0,0,null,null,null,20,0,{"$f":"(Site!$B$32*($G$6*$C34+$G$7*$D34)*3630)*Site!$B$34*0.3048^3/454*Site!$B$31/Site!$B$32*Site!$B$36","v":0},0,0]
[null,null,null,null,null,null,null,null,null,null,null,null,null,null,null,null,null,null,null,null,null,null,"`"]
["5. Dry Swale (RR)",null,null,null,null,null,null,null,null,null,null,null,null,null,null,null,"5. Dry Swale (RR)"]
["5.a. Dry Swale #1 (Spec #10)",40,null,null,{"$f":"SUMIF($N$13:$N$92,$P134,$G$13:$G$92)","v":0},{"$f":"(Site!$B$32*($G$6*$C37+$G$7*$D37)*3630+$E37)*$B37/100","v":0},{"$f":"(Site!$B$32*($G$6*$C37+$G$7*$D37)*3630+$E37)*(1-$B37/100)","v":0},{"$f":"+$F37+$G37","v":0},20,{"$f":"SUMIF($N$13:$N$92,$P134,$M$13:$M$92)","v":0},{"$f":"(Site!$B$32*($G$6*$C37+$G$7*$D37)*3630)*Site!$B$33*0.3048^3/454*Site!$B$31/Site!$B$32*Site!$B$36","v":0},{"$f":"IFERROR(($J37+$K37)*($F37+$G37*$I37/100)/$H37,0)","v":0},{"$f":"$J37+$K37-$L37","v":0},null,null,null,25,{"$f":"SUMIF($N$13:$N$92,$P134,$U$13:$U$92)","v":0},{"$f":"(Site!$B$32*($G$6*$C37+$G$7*$D37)*3630)*Site!$B$34*0.3048^3/454*Site!$B$31/Site!$B$32*Site!$B$36","v":0},{"$f":"IFERROR(($R37+$S37)*($F37+$G37*$Q37/100)/$H37,0)","v":0},{"$f":"$R37+$S37-$T37","v":0}]
["5.b. Dry Swale #2 (Spec #10)",60,null,null,{"$f":"SUMIF($N$13:$N$92,$P135,$G$13:$G$92)","v":0},{"$f":"(Site!$B$32*($G$6*$C38+$G$7*$D38)*3630+$E38)*$B38/100","v":0},{"$f":"(Site!$B$32*($G$6*$C38+$G$7*$D38)*3630+$E38)*(1-$B38/100)","v":0},{"$f":"+$F38+$G38","v":0},40,{"$f":"SUMIF($N$13:$N$92,$P135,$M$13:$M$92)","v":0},{"$f":"(Site!$B$32*($G$6*$C38+$G$7*$D38)*3630)*Site!$B$33*0.3048^3/454*Site!$B$31/Site!$B$32*Site!$B$36","v":0},{"$f":"IFERROR(($J38+$K38)*($F38+$G38*$I38/100)/$H38,0)","v":0},{"$f":"$J38+$K38-$L38","v":0},null,null,null,35,{"$f":"SUMIF($N$13:$N$92,$P135,$U$13:$U$92)","v":0},{"$f":"(Site!$B$32*($G$6*$C38+$G$7*$D38)*3630)*Site!$B$34*0.3048^3/454*Site!$B$31/Site!$B$32*Site!$B$36","v":0},0,0]
[]
["6. Bioretention (RR)",null,null,null,null,null,null,null,null,null,null,null,null,null,null,null,"6. Bioretention (RR)"]
["6.a. Bioretention #1 or Micro-Bioretention #1 or Urban Bioretention (Spec #9)",40,null,null,{"$f":"SUMIF($N$13:$N$92,$P136,$G$13:$G$92)","v":0},{"$f":"(Site!$B$32*($G$6*$C41+$G$7*$D41)*3630+$E41)*$B41/100","v":0},{"$f":"(Site!$B$32*($G$6*$C41+$G$7*$D41)*3630+$E41)*(1-$B41/100)","v":0},{"$f":"+$F41+$G41","v":0},25,{"$f":"SUMIF($N$13:$N$92,$P136,$M$13:$M$92)","v":0},{"$f":"(Site!$B$32*($G$6*$C41+$G$7*$D41)*3630)*Site!$B$33*0.3048^3/454*Site!$B$31/Site!$B$32*Site!$B$36","v":0},{"$f":"IFERROR(($J41+$K41)*($F41+$G41*$I41/100)/$H41,0)","v":0},{"$f":"$J41+$K41-$L41","v":0},null,null,null,40,{"$f":"SUMIF($N$13:$N$92,$P136,$U$13:$U$92)","v":0},{"$f":"(Site!$B$32*($G$6*$C41+$G$7*$D41)*3630)*Site!$B$34*0.3048^3/454*Site!$B$31/Site!$B$32*Site!$B$36","v":0},{"$f":"IFERROR(($R41+$S41)*($F41+$G41*$Q41/100)/$H41,0)","v":0},{"$f":"$R41+$S41-$T41","v":0}]
["6.b. Bioretention #2 or Micro-Bioretention #2 (Spec #9)",80,null,null,{"$f":"SUMIF($N$13:$N$92,$P137,$G$13:$G$92)","v":0},{"$f":"(Site!$B$32*($G$6*$C42+$G$7*$D42)*3630+$E42)*$B42/100","v":0},{"$f":"(Site!$B$32*($G$6*$C42+$G$7*$D42)*3630+$E42)*(1-$B42/100)","v":0},{"$f":"+$F42+$G42","v":0},50,{"$f":"SUMIF($N$13:$N$92,$P137,$M$13:$M$92)","v":0},{"$f":"(Site!$B$32*($G$6*$C42+$G$7*$D42)*3630)*Site!$B$33*0.3048^3/454*Site!$B$31/Site!$B$32*Site!$B$36","v":0},{"$f":"IFERROR(($J42+$K42)*($F42+$G42*$I42/100)/$H42,0)","v":0},{"$f":"$J42+$K42-$L42","v":0},null,null,null,60,{"$f":"SUMIF($N$13:$N$92,$P137,$U$13:$U$92)","v":0},{"$f":"(Site!$B$32*($G$6*$C42+$G$7*$D42)*3630)*Site!$B$34*0.3048^3/454*Site!$B$31/Site!$B$32*Site!$B$36","v":0},0,0]
[]
["7. Infiltration (RR)",null,null,null,null,null,null,null,null,null,null,null,null,null,null,null,"7. Infiltration (RR)"]
["7.a. Infiltration #1 (Spec #8)",50,null,null,{"$f":"SUMIF($N$13:$N$92,$P138,$G$13:$G$92)","v":0},{"$f":"(Site!$B$32*($G$6*$C45+$G$7*$D45)*3630+$E45)*$B45/100","v":0},{"$f":"(Site!$B$32*($G$6*$C45+$G$7*$D45)*3630+$E45)*(1-$B45/100)","v":0},{"$f":"+$F45+$G45","v":0},25,{"$f":"SUMIF($N$13:$N$92,$P138,$M$13:$M$92)","v":0},{"$f":"(Site!$B$32*($G$6*$C45+$G$7*$D45)*3630)*Site!$B$33*0.3048^3/454*Site!$B$31/Site!$B$32*Site!$B$36","v":0},{"$f":"IFERROR(($J45+$K45)*($F45+$G45*$I45/100)/$H45,0)","v":0},{"$f":"$J45+$K45-$L45","v":0},null,null,null,15,{"$f":"SUMIF($N$13:$N$92,$P138,$U$13:$U$92)","v":0},{"$f":"(Site!$B$32*($G$6*$C45+$G$7*$D45)*3630)*Site!$B$34*0.3048^3/454*Site!$B$31/Site!$B$32*Site!$B$36","v":0},{"$f":"IFERROR(($R45+$S45)*($F45+$G45*$Q45/100)/$H45,0)","v":0},{"$f":"$R45+$S45-$T45","v":0}]
["7.b. Infiltration #2 (Spec #8)",90,null,null,{"$f":"SUMIF($N$13:$N$92,$P139,$G$13:$G$92)","v":0},{"$f":"(Site!$B$32*($G$6*$C46+$G$7*$D46)*3630+$E46)*$B46/100","v":0},{"$f":"(Site!$B$32*($G$6*$C46+$G$7*$D46)*3630+$E46)*(1-$B46/100)","v":0},{"$f":"+$F46+$G46","v":0},25,{"$f":"SUMIF($N$13:$N$92,$P139,$M$13:$M$92)","v":0},{"$f":"(Site!$B$32*($G$6*$C46+$G$7*$D46)*3630)*Site!$B$33*0.3048^3/454*Site!$B$31/Site!$B$32*Site!$B$36","v":0},{"$f":"IFERROR(($J46+$K46)*($F46+$G46*$I46/100)/$H46,0)","v":0},{"$f":"$J46+$K46-$L46","v":0},null,null,null,15,{"$f":"SUMIF($N$13:$N$92,$P139,$U$13:$U$92)","v":0},{"$f":"(Site!$B$32*($G$6*$C46+$G$7*$D46)*3630)*Site!$B$34*0.3048^3/454*Site!$B$31/Site!$B$32*Site!$B$36","v":0},0,0]
[]
["8. Extended Detention Pond (RR)",null,null,null,null,null,null,null,null,null,null,null,null,null,null,null,"8. Extended Detention Pond (RR)"]
["8.a. ED #1 (Spec #15)",0,null,null,{"$f":"SUMIF($N$13:$N$92,$P140,$G$13:$G$92)","v":0},{"$f":"(Site!$B$32*($G$6*$C49+$G$7*$D49)*3630+$E49)*$B49/100","v":0},{"$f":"(Site!$B$32*($G$6*$C49+$G$7*$D49)*3630+$E49)*(1-$B49/100)","v":0},{"$f":"+$F49+$G49","v":0},15,{"$f":"SUMIF($N$13:$N$92,$P140,$M$13:$M$92)","v":0},{"$f":"(Site!$B$32*($G$6*$C49+$G$7*$D49)*3630)*Site!$B$33*0.3048^3/454*Site!$B$31/Site!$B$32*Site!$B$36","v":0},{"$f":"IFERROR(($J49+$K49)*($F49+$G49*$I49/100)/$H49,0)","v":0},{"$f":"$J49+$K49-$L49","v":0},null,null,null,10,{"$f":"SUMIF($N$13:$N$92,$P140,$U$13:$U$92)","v":0},{"$f":"(Site!$B$32*($G$6*$C49+$G$7*$D49)*3630)*Site!$B$34*0.3048^3/454*Site!$B$31/Site!$B$32*Site!$B$36","v":0},{"$f":"IFERROR(($R49+$S49)*($F49+$G49*$Q49/100)/$H49,0)","v":0},{"$f":"$R49+$S49-$T49","v":0}]
["8.b. ED #2 (Spec #15)",15,null,null,{"$f":"SUMIF($N$13:$N$92,$P141,$G$13:$G$92)","v":0},{"$f":"(Site!$B$32*($G$6*$C50+$G$7*$D50)*3630+$E50)*$B50/100","v":0},{"$f":"(Site!$B$32*($G$6*$C50+$G$7*$D50)*3630+$E50)*(1-$B50/100)","v":0},{"$f":"+$F50+$G50","v":0},15,{"$f":"SUMIF($N$13:$N$92,$P141,$M$13:$M$92)","v":0},{"$f":"(Site!$B$32*($G$6*$C50+$G$7*$D50)*3630)*Site!$B$33*0.3048^3/454*Site!$B$31/Site!$B$32*Site!$B$36","v":0},0,0,null,null,null,10,{"$f":"SUMIF($N$13:$N$92,$P141,$U$13:$U$92)","v":0},{"$f":"(Site!$B$32*($G$6*$C50+$G$7*$D50)*3630)*Site!$B$34*0.3048^3/454*Site!$B$31/Site!$B$32*Site!$B$36","v":0},0,0]
[]
["9. Sheetflow to Filter/Open Space (RR)",null,null,null,null,null,null,null,null,null,null,null,null,null,null,null,"9. Sheetflow to Filter/Open Space (RR)"]
["9.a. Sheetflow to Conservation Area, A/B Soils (Spec #2)",75,null,null,{"$f":"SUMIF($N$13:$N$92,$P142,$G$13:$G$92)","v":0},{"$f":"(Site!$B$32*($G$6*$C53+$G$7*$D53)*3630+$E53)*$B53/100","v":0},{"$f":"(Site!$B$32*($G$6*$C53+$G$7*$D53)*3630+$E53)*(1-$B53/100)","v":0},{"$f":"+$F53+$G53","v":0},0,{"$f":"SUMIF($N$13:$N$92,$P142,$M$13:$M$92)","v":0},{"$f":"(Site!$B$32*($G$6*$C53+$G$7*$D53)*3630)*Site!$B$33*0.3048^3/454*Site!$B$31/Site!$B$32*Site!$B$36","v":0},{"$f":"IFERROR(($J53+$K53)*($F53+$G53*$I53/100)/$H53,0)","v":0},{"$f":"$J53+$K53-$L53","v":0},null,null,null,0,{"$f":"SUMIF($N$13:$N$92,$P142,$U$13:$U$92)","v":0},{"$f":"(Site!$B$32*($G$6*$C53+$G$7*$D53)*3630)*Site!$B$34*0.3048^3/454*Site!$B$31/Site!$B$32*Site!$B$36","v":0},{"$f":"IFERROR(($R53+$S53)*($F53+$G53*$Q53/100)/$H53,0)","v":0},{"$f":"$R53+$S53-$T53","v":0}]
["9.b. Sheetflow to Conservation Area, C/D Soils (Spec #2)",50,null,null,{"$f":"SUMIF($N$13:$N$92,$P143,$G$13:$G$92)","v":0},{"$f":"(Site!$B$32*($G$6*$C54+$G$7*$D54)*3630+$E54)*$B54/100","v":0},{"$f":"(Site!$B$32*($G$6*$C54+$G$7*$D54)*3630+$E54)*(1-$B54/100)","v":0},{"$f":"+$F54+$G54","v":0},0,{"$f":"SUMIF($N$13:$N$92,$P143,$M$13:$M$92)","v":0},{"$f":"(Site!$B$32*($G$6*$C54+$G$7*$D54)*3630)*Site!$B$33*0.3048^3/454*Site!$B$31/Site!$B$32*Site!$B$36","v":0},0,0,null,null,null,0,{"$f":"SUMIF($N$13:$N$92,$P143,$U$13:$U$92)","v":0},{"$f":"(Site!$B$32*($G$6*$C54+$G$7*$D54)*3630)*Site!$B$34*0.3048^3/454*Site!$B$31/Site!$B$32*Site!$B$36","v":0},0,0]
["9.c. Sheetflow to Vegetated Filter Strip, A Soils or Compost Amended B/C/D Soils \n(Spec #2 & #4)",50,null,null,0,{"$f":"(Site!$B$32*($G$6*$C55+$G$7*$D55)*3630+$E55)*$B55/100","v":0},{"$f":"(Site!$B$32*($G$6*$C55+$G$7*$D55)*3630+$E55)*(1-$B55/100)","v":0},0,0,0,{"$f":"(Site!$B$32*($G$6*$C55+$G$7*$D55)*3630)*Site!$B$33*0.3048^3/454*Site!$B$31/Site!$B$32*Site!$B$36","v":0},0,0,null,null,null,0,0,{"$f":"(Site!$B$32*($G$6*$C55+$G$7*$D55)*3630)*Site!$B$34*0.3048^3/454*Site!$B$31/Site!$B$32*Site!$B$36","v":0},0,0]
[]
[]
[null,null,null,null,"TOTAL IMPERVIOUS COVER TREATED (ac)",{"$f":"SUM(D13:D55)","v":0},"AREA CHECK:",{"$f":"IF(F58>$F$7,\"AREA EXCEEDED!\",\"OK.\")","v":"OK."}]
[null,null,null,null,"TOTAL MANAGED TURF AREA TREATED (ac)",{"$f":"SUM(C32:C55)","v":0},"AREA CHECK:",{"$f":"IF(F59>$F$6,\"AREA EXCEEDED!\",\"OK.\")","v":"OK."}]
[null,null,null,null,"TOTAL RUNOFF REDUCTION IN D.A. D (ft3)",{"$f":"IFERROR(SUM($F$13:$F$55),0)","v":0}]
[]
[null,null,null,null,null,null,null,"TOTAL PHOSPHORUS AVAILABLE FOR REMOVAL IN D.A. D (lb/yr)",{"$f":"$M$7","v":0}]
[null,null,null,null,null,null,null,"TOTAL PHOSPHORUS REMOVED WITH RUNOFF REDUCTION PRACTICES IN D.A. D (lb/yr)",{"$f":"IFERROR(SUM(L13:L55),0)","v":0},null,null,null,null,null,null,null,null,null,null,null,"TOTAL RUNOFF REDUCTION IN D.A. D (ft3)",{"$f":"F60","v":0}]
[null,null,null,null,null,null,null,"TOTAL PHOSPHORUS REMAINING AFTER APPLYING RUNOFF REDUCTION PRACTICES IN D.A. D (lb/yr)",{"$f":"I62-I63","v":0},null,null,null,null,null,null,null,null,null,null,null,"NITROGEN REMOVED WITH RUNOFF REDUCTION PRACTICES IN D.A. D (lb/yr)",{"$f":"SUM($T$13:$T$55)","v":0}]
[]
[null,null,"SEE WATER QUALITY COMPLIANCE TAB FOR SITE COMPLIANCE CALCULATIONS",null,null,null,null,null,null,null,null,null,null,null,null,null,null,null,null,null,null,"           SEE WATER QUALITY COMPLIANCE TAB FOR SITE CALCULATIONS (Information Only)"]
[]
[]
[]
[]
["10. Wet Swale (no RR)",null,null,null,null,null,null,null,null,null,null,null,null,null,null,null,null,"10. Wet Swale (Coastal Plain) (no RR)"]
["10.a. Wet Swale #1 (Spec #11)",0,null,null,{"$f":"SUMIF($N$13:$N$92,$P145,$G$13:$G$92)","v":0},{"$f":"(Site!$B$32*($G$6*$C72+$G$7*$D72)*3630+$E72)*$B72/100","v":0},{"$f":"(Site!$B$32*($G$6*$C72+$G$7*$D72)*3630+$E72)*(1-$B72/100)","v":0},{"$f":"+$F72+$G72","v":0},20,{"$f":"SUMIF($N$13:$N$92,$P145,$M$13:$M$92)","v":0},{"$f":"(Site!$B$32*($G$6*$C72+$G$7*$D72)*3630)*Site!$B$33*0.3048^3/454*Site!$B$31/Site!$B$32*Site!$B$36","v":0},{"$f":"IFERROR(($J72+$K72)*($F72+$G72*$I72/100)/$H72,0)","v":0},{"$f":"$J72+$K72-$L72","v":0},null,null,null,25,{"$f":"SUMIF($N$13:$N$92,$P145,$U$13:$U$92)","v":0},{"$f":"(Site!$B$32*($G$6*$C72+$G$7*$D72)*3630)*Site!$B$34*0.3048^3/454*Site!$B$31/Site!$B$32*Site!$B$36","v":0},{"$f":"IFERROR(($R72+$S72)*($F72+$G72*$Q72/100)/$H72,0)","v":0},{"$f":"$R72+$S72-$T72","v":0}]
["10.b. Wet Swale #2 (Spec #11)",0,null,null,{"$f":"SUMIF($N$13:$N$92,$P146,$G$13:$G$92)","v":0},{"$f":"(Site!$B$32*($G$6*$C73+$G$7*$D73)*3630+$E73)*$B73/100","v":0},{"$f":"(Site!$B$32*($G$6*$C73+$G$7*$D73)*3630+$E73)*(1-$B73/100)","v":0},0,40,{"$f":"SUMIF($N$13:$N$92,$P146,$M$13:$M$92)","v":0},{"$f":"(Site!$B$32*($G$6*$C73+$G$7*$D73)*3630)*Site!$B$33*0.3048^3/454*Site!$B$31/Site!$B$32*Site!$B$36","v":0},0,0,null,null,null,35,{"$f":"SUMIF($N$13:$N$92,$P146,$U$13:$U$92)","v":0},{"$f":"(Site!$B$32*($G$6*$C73+$G$7*$D73)*3630)*Site!$B$34*0.3048^3/454*Site!$B$31/Site!$B$32*Site!$B$36","v":0},0,0]
[]
["11.  Filtering Practices (no RR)",null,null,null,null,null,null,null,null,null,null,null,null,null,null,null,"11.  Filtering Practices (no RR)"]
["11.a.Filtering Practice #1 (Spec #12)",0,null,null,{"$f":"SUMIF($N$13:$N$92,$P147,$G$13:$G$92)","v":0},{"$f":"(Site!$B$32*($G$6*$C76+$G$7*$D76)*3630+$E76)*$B76/100","v":0},{"$f":"(Site!$B$32*($G$6*$C76+$G$7*$D76)*3630+$E76)*(1-$B76/100)","v":0},{"$f":"+$F76+$G76","v":0},60,{"$f":"SUMIF($N$13:$N$92,$P147,$M$13:$M$92)","v":0},{"$f":"(Site!$B$32*($G$6*$C76+$G$7*$D76)*3630)*Site!$B$33*0.3048^3/454*Site!$B$31/Site!$B$32*Site!$B$36","v":0},{"$f":"IFERROR(($J76+$K76)*($F76+$G76*$I76/100)/$H76,0)","v":0},{"$f":"$J76+$K76-$L76","v":0},null,null,null,30,{"$f":"SUMIF($N$13:$N$92,$P147,$U$13:$U$92)","v":0},{"$f":"(Site!$B$32*($G$6*$C76+$G$7*$D76)*3630)*Site!$B$34*0.3048^3/454*Site!$B$31/Site!$B$32*Site!$B$36","v":0},{"$f":"IFERROR(($R76+$S76)*($F76+$G76*$Q76/100)/$H76,0)","v":0},{"$f":"$R76+$S76-$T76","v":0}]
["11.b. Filtering Practice #2 (Spec #12)",0,null,null,{"$f":"SUMIF($N$13:$N$92,$P148,$G$13:$G$92)","v":0},{"$f":"(Site!$B$32*($G$6*$C77+$G$7*$D77)*3630+$E77)*$B77/100","v":0},{"$f":"(Site!$B$32*($G$6*$C77+$G$7*$D77)*3630+$E77)*(1-$B77/100)","v":0},0,65,{"$f":"SUMIF($N$13:$N$92,$P148,$M$13:$M$92)","v":0},{"$f":"(Site!$B$32*($G$6*$C77+$G$7*$D77)*3630)*Site!$B$33*0.3048^3/454*Site!$B$31/Site!$B$32*Site!$B$36","v":0},0,0,null,null,null,45,{"$f":"SUMIF($N$13:$N$92,$P148,$U$13:$U$92)","v":0},{"$f":"(Site!$B$32*($G$6*$C77+$G$7*$D77)*3630)*Site!$B$34*0.3048^3/454*Site!$B$31/Site!$B$32*Site!$B$36","v":0},0,0]
[]
["12. Constructed Wetland (no RR)",null,null,null,null,null,null,null,null,null,null,null,null,null,null,null,"12. Constructed Wetland (no RR)"]
["12.a.Constructed Wetland #1 (Spec #13)",0,null,null,{"$f":"SUMIF($N$13:$N$92,$P149,$G$13:$G$92)","v":0},{"$f":"(Site!$B$32*($G$6*$C80+$G$7*$D80)*3630+$E80)*$B80/100","v":0},{"$f":"(Site!$B$32*($G$6*$C80+$G$7*$D80)*3630+$E80)*(1-$B80/100)","v":0},{"$f":"+$F80+$G80","v":0},50,{"$f":"SUMIF($N$13:$N$92,$P149,$M$13:$M$92)","v":0},{"$f":"(Site!$B$32*($G$6*$C80+$G$7*$D80)*3630)*Site!$B$33*0.3048^3/454*Site!$B$31/Site!$B$32*Site!$B$36","v":0},{"$f":"IFERROR(($J80+$K80)*($F80+$G80*$I80/100)/$H80,0)","v":0},{"$f":"$J80+$K80-$L80","v":0},null,null,null,25,{"$f":"SUMIF($N$13:$N$92,$P149,$U$13:$U$92)","v":0},{"$f":"(Site!$B$32*($G$6*$C80+$G$7*$D80)*3630)*Site!$B$34*0.3048^3/454*Site!$B$31/Site!$B$32*Site!$B$36","v":0},{"$f":"IFERROR(($R80+$S80)*($F80+$G80*$Q80/100)/$H80,0)","v":0},{"$f":"$R80+$S80-$T80","v":0}]
["12.b. Constructed Wetland #2 (Spec #13)",0,null,null,{"$f":"SUMIF($N$13:$N$92,$P150,$G$13:$G$92)","v":0},{"$f":"(Site!$B$32*($G$6*$C81+$G$7*$D81)*3630+$E81)*$B81/100","v":0},{"$f":"(Site!$B$32*($G$6*$C81+$G$7*$D81)*3630+$E81)*(1-$B81/100)","v":0},0,75,{"$f":"SUMIF($N$13:$N$92,$P150,$M$13:$M$92)","v":0},{"$f":"(Site!$B$32*($G$6*$C81+$G$7*$D81)*3630)*Site!$B$33*0.3048^3/454*Site!$B$31/Site!$B$32*Site!$B$36","v":0},0,0,null,null,null,55,{"$f":"SUMIF($N$13:$N$92,$P150,$U$13:$U$92)","v":0},{"$f":"(Site!$B$32*($G$6*$C81+$G$7*$D81)*3630)*Site!$B$34*0.3048^3/454*Site!$B$31/Site!$B$32*Site!$B$36","v":0},0,0]
[]
["13. Wet Ponds (no RR)",null,null,null,null,null,null,null,null,null,null,null,null,null,null,null,"13. Wet Ponds (no RR)"]
["13.a. Wet Pond #1 (Spec #14)",0,null,null,{"$f":"SUMIF($N$13:$N$92,$P151,$G$13:$G$92)","v":0},{"$f":"(Site!$B$32*($G$6*$C84+$G$7*$D84)*3630+$E84)*$B84/100","v":0},{"$f":"(Site!$B$32*($G$6*$C84+$G$7*$D84)*3630+$E84)*(1-$B84/100)","v":0},{"$f":"+$F84+$G84","v":0},50,{"$f":"SUMIF($N$13:$N$92,$P151,$M$13:$M$92)","v":0},{"$f":"(Site!$B$32*($G$6*$C84+$G$7*$D84)*3630)*Site!$B$33*0.3048^3/454*Site!$B$31/Site!$B$32*Site!$B$36","v":0},{"$f":"IFERROR(($J84+$K84)*($F84+$G84*$I84/100)/$H84,0)","v":0},{"$f":"$J84+$K84-$L84","v":0},null,null,null,30,{"$f":"SUMIF($N$13:$N$92,$P151,$U$13:$U$92)","v":0},{"$f":"(Site!$B$32*($G$6*$C84+$G$7*$D84)*3630)*Site!$B$34*0.3048^3/454*Site!$B$31/Site!$B$32*Site!$B$36","v":0},{"$f":"IFERROR(($R84+$S84)*($F84+$G84*$Q84/100)/$H84,0)","v":0},{"$f":"$R84+$S84-$T84","v":0}]
["13.b. Wet Pond #1 (Coastal Plain) (Spec #14)",0,null,null,{"$f":"SUMIF($N$13:$N$92,$P152,$G$13:$G$92)","v":0},{"$f":"(Site!$B$32*($G$6*$C85+$G$7*$D85)*3630+$E85)*$B85/100","v":0},{"$f":"(Site!$B$32*($G$6*$C85+$G$7*$D85)*3630+$E85)*(1-$B85/100)","v":0},0,45,{"$f":"SUMIF($N$13:$N$92,$P152,$M$13:$M$92)","v":0},{"$f":"(Site!$B$32*($G$6*$C85+$G$7*$D85)*3630)*Site!$B$33*0.3048^3/454*Site!$B$31/Site!$B$32*Site!$B$36","v":0},0,0,null,null,null,20,{"$f":"SUMIF($N$13:$N$92,$P152,$U$13:$U$92)","v":0},{"$f":"(Site!$B$32*($G$6*$C85+$G$7*$D85)*3630)*Site!$B$34*0.3048^3/454*Site!$B$31/Site!$B$32*Site!$B$36","v":0},0,0]
["13.c. Wet Pond #2 (Spec #14)",0,null,null,0,{"$f":"(Site!$B$32*($G$6*$C86+$G$7*$D86)*3630+$E86)*$B86/100","v":0},{"$f":"(Site!$B$32*($G$6*$C86+$G$7*$D86)*3630+$E86)*(1-$B86/100)","v":0},0,75,0,{"$f":"(Site!$B$32*($G$6*$C86+$G$7*$D86)*3630)*Site!$B$33*0.3048^3/454*Site!$B$31/Site!$B$32*Site!$B$36","v":0},0,0,null,null,null,40,0,{"$f":"(Site!$B$32*($G$6*$C86+$G$7*$D86)*3630)*Site!$B$34*0.3048^3/454*Site!$B$31/Site!$B$32*Site!$B$36","v":0},0,0]
["13.d. Wet Pond #2 (Coastal Plain) (Spec #14)",0,null,null,0,{"$f":"(Site!$B$32*($G$6*$C87+$G$7*$D87)*3630+$E87)*$B87/100","v":0},{"$f":"(Site!$B$32*($G$6*$C87+$G$7*$D87)*3630+$E87)*(1-$B87/100)","v":0},0,65,0,{"$f":"(Site!$B$32*($G$6*$C87+$G$7*$D87)*3630)*Site!$B$33*0.3048^3/454*Site!$B$31/Site!$B$32*Site!$B$36","v":0},0,0,null,null,null,30,0,{"$f":"(Site!$B$32*($G$6*$C87+$G$7*$D87)*3630)*Site!$B$34*0.3048^3/454*Site!$B$31/Site!$B$32*Site!$B$36","v":0},0,0]
[]
["14. Manufactured Treatment Devices (no RR)",null,null,null,null,null,null,null,null,null,null,null,null,null,null,null,null,"14. Manufactured BMP (no RR)"]
["14.a. Manufactured Treatment Device-Hydrodynamic",0,null,null,{"$f":"SUMIF($N$13:$N$92,$P155,$G$13:$G$92)","v":0},{"$f":"(Site!$B$32*($G$6*$C90+$G$7*$D90)*3630+$E90)*$B90/100","v":0},{"$f":"(Site!$B$32*($G$6*$C90+$G$7*$D90)*3630+$E90)*(1-$B90/100)","v":0},{"$f":"+$F90+$G90","v":0},20,{"$f":"SUMIF($N$13:$N$92,$P155,$M$13:$M$92)","v":0},{"$f":"(Site!$B$32*($G$6*$C90+$G$7*$D90)*3630)*Site!$B$33*0.3048^3/454*Site!$B$31/Site!$B$32*Site!$B$36","v":0},{"$f":"IFERROR(($J90+$K90)*($F90+$G90*$I90/100)/$H90,0)","v":0},{"$f":"$J90+$K90-$L90","v":0},null,null,null,0,{"$f":"SUMIF($N$13:$N$92,$P155,$U$13:$U$92)","v":0},{"$f":"(Site!$B$32*($G$6*$C90+$G$7*$D90)*3630)*Site!$B$34*0.3048^3/454*Site!$B$31/Site!$B$32*Site!$B$36","v":0},{"$f":"IFERROR(($R90+$S90)*($F90+$G90*$Q90/100)/$H90,0)","v":0},{"$f":"$R90+$S90-$T90","v":0}]
["14.b. Manufactured Treatment Device-Filtering",0,null,null,{"$f":"SUMIF($N$13:$N$92,$P156,$G$13:$G$92)","v":0},{"$f":"(Site!$B$32*($G$6*$C91+$G$7*$D91)*3630+$E91)*$B91/100","v":0},{"$f":"(Site!$B$32*($G$6*$C91+$G$7*$D91)*3630+$E91)*(1-$B91/100)","v":0},0,20,{"$f":"SUMIF($N$13:$N$92,$P156,$M$13:$M$92)","v":0},{"$f":"(Site!$B$32*($G$6*$C91+$G$7*$D91)*3630)*Site!$B$33*0.3048^3/454*Site!$B$31/Site!$B$32*Site!$B$36","v":0},0,0,null,null,null,0,{"$f":"SUMIF($N$13:$N$92,$P156,$U$13:$U$92)","v":0},{"$f":"(Site!$B$32*($G$6*$C91+$G$7*$D91)*3630)*Site!$B$34*0.3048^3/454*Site!$B$31/Site!$B$32*Site!$B$36","v":0},0,0]
["14.c. Manufactured Treatment Device-Generic",0,null,null,0,{"$f":"(Site!$B$32*($G$6*$C92+$G$7*$D92)*3630+$E92)*$B92/100","v":0},{"$f":"(Site!$B$32*($G$6*$C92+$G$7*$D92)*3630+$E92)*(1-$B92/100)","v":0},0,20,0,{"$f":"(Site!$B$32*($G$6*$C92+$G$7*$D92)*3630)*Site!$B$33*0.3048^3/454*Site!$B$31/Site!$B$32*Site!$B$36","v":0},0,0,null,null,null,0,0,{"$f":"(Site!$B$32*($G$6*$C92+$G$7*$D92)*3630)*Site!$B$34*0.3048^3/454*Site!$B$31/Site!$B$32*Site!$B$36","v":0},0,0]
[]
[]
[]
[null,null,null,null,"TOTAL IMPERVIOUS COVER TREATED (ac)",{"$f":"SUM($D$13:$D$92)","v":0},"AREA CHECK:",{"$f":"IF($F$96>$F$7,\"AREA EXCEEDED!\",\"OK.\")","v":"OK."}]
[null,null,null,null,"TOTAL MANAGED TURF AREA TREATED (ac)",{"$f":"SUM($C$13:$C$92)","v":0},"AREA CHECK:",{"$f":"IF($F$97>$F$6,\"AREA EXCEEDED!\",\"OK.\")","v":"OK."}]
[]
[null,null,null,null,null,null,null,"TOTAL PHOSPHORUS REMOVAL REQUIRED ON SITE (lb/yr)",{"$f":"IF(Site!G63=\"Check Areas!\",\"ERROR - \",Site!G63)","v":"--"},{"$f":"IF(I99=\"ERROR - \",\"Site Data Tab\",\"\")","v":""}]
[]
[null,null,null,null,null,null,null,"TOTAL PHOSPHORUS AVAILABLE FOR REMOVAL IN D.A. D (lb/yr)",{"$f":"$M$7","v":0}]
[null,null,null,null,null,null,null,"TOTAL PHOSPHORUS REMOVED WITHOUT RUNOFF REDUCTION PRACTICES IN D.A. D (lb/yr)",{"$f":"SUM($L$72:$L$92)","v":0}]
[null,null,null,null,null,null,null,"TOTAL PHOSPHORUS REMOVED WITH RUNOFF REDUCTION PRACTICES IN D.A. D (lb/yr)",{"$f":"$I$63","v":0}]
[null,null,null,null,null,null,null,"TOTAL PHOSPHORUS LOAD REDUCTION ACHIEVED IN D.A. D (lb/yr)",{"$f":"$I$102+$I$103","v":0}]
[null,null,null,null,null,null,null,"TOTAL PHOSPHORUS REMAINING AFTER APPLYING BMP LOAD REDUCTIONS IN D.A. D (lb/yr)",{"$f":"$I$101-$I$104","v":0}]
[]
[null,null,"SEE WATER QUALITY COMPLIANCE TAB FOR SITE COMPLIANCE CALCULATIONS"]
[]
[null,null,null,null,null,null,null,"NITROGEN REMOVED WITH RUNOFF REDUCTION PRACTICES IN D.A. D (lb/yr)",{"$f":"IFERROR(SUM($T$13:$T$55),0)","v":0}]
[null,null,null,null,null,null,null,"NITROGEN REMOVED WITHOUT RUNOFF REDUCTION PRACTICES IN D.A. D (lb/yr)",{"$f":"SUM($T$72:$T$92)","v":0}]
[null,null,null,null,null,null,null,"TOTAL NITROGEN REMOVED IN D.A. D (lb/yr)",{"$f":"$I$109+$I$110","v":0}]
[]
[]
[]
[]
[null,null,"Downstream Practices - Dropdown selections for each applicable BMP"]
[]
["Options for 1. Green Roof",null,"Options for 2. Impervious Surface Disconnection",null,"Options for 3a. Pervious Parking, A/B Soils",null,"Options for 4a. Grass Channels, A/B Soils",null,null,"Options for 4b. Grass Channels, C/D Soils"]
[null,null,null,null,null,null,null,null,null,null,null,"Options for 4.c. Grass Channel Compost Amended Soils",null,null,null,"Master Downstream BMP Reference List"]
[{"$f":"P120","v":"None"},null,{"$f":"P120","v":"None"},null,{"$f":"P120","v":"None"},null,{"$f":"P120","v":"None"},null,null,{"$f":"P120","v":"None"},null,null,null,null,null,"None"]
["2.a. Simple Disconnection to A/B Soils",null,{"$f":"P131","v":"4.a. Grass Channel A/B Soils"},null,{"$f":"P131","v":"4.a. Grass Channel A/B Soils"},null,{"$f":"P132","v":"4.b. Grass Channel C/D Soils"},null,null,{"$f":"P131","v":"4.a. Grass Channel A/B Soils"},null,{"$f":"P120","v":"None"},null,null,null,"2.a. Simple Disconnection to A/B Soils"]
["2.b. Simple Disconnection to C/D Soils",null,"4.b. Grass Channel C/D Soils",null,"4.b. Grass Channel C/D Soils",null,"4.c. Grass Channel Compost Amended Soils",null,null,{"$f":"P133","v":"4.c. Grass Channel Compost Amended Soils"},null,{"$f":"P131","v":"4.a. Grass Channel A/B Soils"},null,null,null,"2.b. Simple Disconnection to C/D Soils"]
["2.c. To Soil Amended Filter Path",null,"4.c. Grass Channel Compost Amended Soils",null,"4.c. Grass Channel Compost Amended Soils",null,"5.a. Dry Swale #1",null,null,"5.a. Dry Swale #1",null,{"$f":"P132","v":"4.b. Grass Channel C/D Soils"},null,null,null,"2.c. To Soil Amended Filter Path"]
["2.d. To Dry Well/French Drain #1 (Micro-Infiltration #1)",null,"5.a. Dry Swale #1",null,"5.a. Dry Swale #1",null,"5.b. Dry Swale #2",null,null,"5.b. Dry Swale #2",null,{"$f":"P134","v":"5.a. Dry Swale #1"},null,null,null,"2.d. To Dry Well/French Drain #1 (Micro-Infiltration #1)"]
["2.e. To Dry Well/French Drain #2 (Micro-Infiltration. #2)",null,"5.b. Dry Swale #2",null,"5.b. Dry Swale #2",null,"6.a. Bioretention #1",null,null,"6.a. Bioretention #1",null,"5.b. Dry Swale #2",null,null,null,"2.e. To Dry Well/French Drain #2 (Micro-Infiltration. #2)"]
["2.f. To Rain Garden #1 (Micro-Bioretention #1)",null,"6.a. Bioretention #1",null,"6.a. Bioretention #1",null,"6.b. Bioretention #2",null,null,"6.b. Bioretention #2",null,"6.a. Bioretention #1",null,null,null,"2.f. To Rain Garden #1 (Micro-Bioretention #1)"]
["2.g. To Rain Garden #2 (Micro-Bioretention #2)",null,"6.b. Bioretention #2",null,"6.b. Bioretention #2",null,"7.a. Infiltration #1",null,null,"7.a. Infiltration #1",null,"6.b. Bioretention #2",null,null,null,"2.g. To Rain Garden #2 (Micro-Bioretention #2)"]
["2.h. To Train Barrel, Rain Tank, or Cistern",null,"7.a. Infiltration #1",null,"7.a. Infiltration #1",null,"7.b. Infiltration #2",null,null,"7.b. Infiltration #2",null,"7.a. Infiltration #1",null,null,null,"2.h. To Train Barrel, Rain Tank, or Cistern"]
["2.i. To Stormwater Planter (Urban Bioretention)",null,"7.b. Infiltration #2",null,"7.b. Infiltration #2",null,"8.a. ED #1",null,null,"8.a. ED #1",null,"7.b. Infiltration #2",null,null,null,"2.i. To Stormwater Planter (Urban Bioretention)"]
["3.a. Permeable Pavement #1",null,"8.a. ED #1",null,"8.a. ED #1",null,"8.b. ED #2",null,null,"8.b. ED #2",null,"8.a. ED #1",null,null,null,"3.a. Permeable Pavement #1"]
["4.a. Grass Channel A/B Soils",null,"8.b. ED #2",null,"8.b. ED #2",null,"9.a. Sheetflow to A/B Soil Conservation Area ",null,null,"9.a. Sheetflow to A/B Soil Conservation Area ",null,"8.b. ED #2",null,null,null,"4.a. Grass Channel A/B Soils"]
["4.b. Grass Channel C/D Soils",null,"9.a. Sheetflow to A/B Soil Conservation Area ",null,"9.a. Sheetflow to A/B Soil Conservation Area ",null,"9.b. Sheetflow to C/D Soil Conservation Area",null,null,"9.b. Sheetflow to C/D Soil Conservation Area",null,"9.a. Sheetflow to A/B Soil Conservation Area ",null,null,null,"4.b. Grass Channel C/D Soils"]
["4.c. Grass Channel Compost Amended Soils",null,"9.b. Sheetflow to C/D Soil Conservation Area",null,"9.b. Sheetflow to C/D Soil Conservation Area",null,"9.c. Sheetflow to Vegetated Filter Strip",null,null,"9.c. Sheetflow to Vegetated Filter Strip",null,"9.b. Sheetflow to C/D Soil Conservation Area",null,null,null,"4.c. Grass Channel Compost Amended Soils"]
["5.a. Dry Swale #1",null,"9.c. Sheetflow to Vegetated Filter Strip",null,"9.c. Sheetflow to Vegetated Filter Strip",null,"10.a. Wet Swale #1",null,null,"10.a. Wet Swale #1",null,"9.c. Sheetflow to Vegetated Filter Strip",null,null,null,"5.a. Dry Swale #1"]
["5.b. Dry Swale #2",null,"10.a. Wet Swale #1",null,"10.a. Wet Swale #1",null,"10.b. Wet Swale #2",null,null,"10.b. Wet Swale #2",null,"10.a. Wet Swale #1",null,null,null,"5.b. Dry Swale #2"]
["6.a. Bioretention #1",null,"10.b. Wet Swale #2",null,"10.b. Wet Swale #2",null,"11.a. Filtering Practice #1",null,null,"11.a. Filtering Practice #1",null,"10.b. Wet Swale #2",null,null,null,"6.a. Bioretention #1"]
["6.b. Bioretention #2",null,"11.a. Filtering Practice #1",null,"11.a. Filtering Practice #1",null,"11.b. Filtering Practice #2",null,null,"11.b. Filtering Practice #2",null,"11.a. Filtering Practice #1",null,null,null,"6.b. Bioretention #2"]
["7.a. Infiltration #1",null,"11.b. Filtering Practice #2",null,"11.b. Filtering Practice #2",null,"12.a. Constructed Wetland #1",null,null,"12.a. Constructed Wetland #1",null,"11.b. Filtering Practice #2",null,null,null,"7.a. Infiltration #1"]
["7.b. Infiltration #2",null,"12.a. Constructed Wetland #1",null,"12.a. Constructed Wetland #1",null,"12.b. Constructed Wetland #2",null,null,"12.b. Constructed Wetland #2",null,"12.a. Constructed Wetland #1",null,null,null,"7.b. Infiltration #2"]
["8.a. ED #1",null,"12.b. Constructed Wetland #2",null,"12.b. Constructed Wetland #2",null,"13.a. Wet Pond #1",null,null,"13.a. Wet Pond #1",null,"12.b. Constructed Wetland #2",null,null,null,"8.a. ED #1"]
["8.b. ED #2",null,"13.a. Wet Pond #1",null,"13.a. Wet Pond #1",null,"13.b. Wet Pond #1 (Coastal Plain)",null,null,"13.b. Wet Pond #1 (Coastal Plain)",null,"13.a. Wet Pond #1",null,null,null,"8.b. ED #2"]
["9.a. Sheetflow to A/B Soil Conservation Area ",null,"13.b. Wet Pond #1 (Coastal Plain)",null,"13.b. Wet Pond #1 (Coastal Plain)",null,"13.c. Wet Pond #2",null,null,"13.c. Wet Pond #2",null,"13.b. Wet Pond #1 (Coastal Plain)",null,null,null,"9.a. Sheetflow to A/B Soil Conservation Area "]
["9.b. Sheetflow to C/D Soil Conservation Area",null,"13.c. Wet Pond #2",null,"13.c. Wet Pond #2",null,"13.d. Wet Pond #2 (Coastal Plain)",null,null,"13.d. Wet Pond #2 (Coastal Plain)",null,"13.c. Wet Pond #2",null,null,null,"9.b. Sheetflow to C/D Soil Conservation Area"]
["9.c. Sheetflow to Vegetated Filter Strip",null,"13.d. Wet Pond #2 (Coastal Plain)",null,"13.d. Wet Pond #2 (Coastal Plain)",null,"14.a. MTD - Hydrodynamic",null,null,"14.a. MTD - Hydrodynamic",null,"13.d. Wet Pond #2 (Coastal Plain)",null,null,null,"9.c. Sheetflow to Vegetated Filter Strip"]
["10.a. Wet Swale #1",null,"14.a. MTD - Hydrodynamic",null,"14.a. MTD - Hydrodynamic",null,"14.b. MTD - Filtering",null,null,"14.b. MTD - Filtering",null,"14.a. MTD - Hydrodynamic",null,null,null,"10.a. Wet Swale #1"]
["10.b. Wet Swale #2",null,"14.b. MTD - Filtering",null,"14.b. MTD - Filtering",null,"14.c. MTD - Generic",null,null,"14.c. MTD - Generic",null,"14.b. MTD - Filtering",null,null,null,"10.b. Wet Swale #2"]
["11.a. Filtering Practice #1",null,"14.c. MTD - Generic",null,"14.c. MTD - Generic",null,null,null,null,null,null,"14.c. MTD - Generic",null,null,null,"11.a. Filtering Practice #1"]
["11.b. Filtering Practice #2",null,null,null,null,null,null,null,null,null,null,null,null,null,null,"11.b. Filtering Practice #2"]
["12.a. Constructed Wetland #1",null,null,null,null,null,null,null,null,null,null,null,null,null,null,"12.a. Constructed Wetland #1"]
["12.b. Constructed Wetland #2",null,null,null,null,null,null,null,null,null,null,null,null,null,null,"12.b. Constructed Wetland #2"]
["13.a. Wet Pond #1",null,null,null,null,null,null,null,null,null,null,null,null,null,null,"13.a. Wet Pond #1"]
["13.b. Wet Pond #1 (Coastal Plain)",null,null,null,null,null,null,null,null,null,null,null,null,null,null,"13.b. Wet Pond #1 (Coastal Plain)"]
["13.c. Wet Pond #2",null,null,null,null,null,null,null,null,null,null,null,null,null,null,"13.c. Wet Pond #2"]
["13.d. Wet Pond #2 (Coastal Plain)",null,null,null,null,null,null,null,null,null,null,null,null,null,null,"13.d. Wet Pond #2 (Coastal Plain)"]
["14.a. MTD - Hydrodynamic",null,null,null,null,null,null,null,null,null,null,null,null,null,null,"14.a. MTD - Hydrodynamic"]
["14.b. MTD - Filtering",null,null,null,null,null,null,null,null,null,null,null,null,null,null,"14.b. MTD - Filtering"]
["14.c. MTD - Generic",null,null,null,null,null,null,null,null,null,null,null,null,null,null,"14.c. MTD - Generic"]
[]
["Options for 5a. Dry Swale #1",null,"Options for 5b. Dry Swale #2",null,"Options for 6a. Bioretention #1",null,"Options for 6b. Bioretention #2",null,null,"Options for 7a. Infiltration #1",null,"Options for 7b. Infiltration #2"]
[]
[{"$f":"P120","v":"None"},null,{"$f":"P120","v":"None"},null,{"$f":"P120","v":"None"},null,{"$f":"P120","v":"None"},null,null,{"$f":"P120","v":"None"},null,{"$f":"P120","v":"None"}]
[{"$f":"P131","v":"4.a. Grass Channel A/B Soils"},null,{"$f":"P131","v":"4.a. Grass Channel A/B Soils"},null,{"$f":"P131","v":"4.a. Grass Channel A/B Soils"},null,{"$f":"P131","v":"4.a. Grass Channel A/B Soils"},null,null,{"$f":"P131","v":"4.a. Grass Channel A/B Soils"},null,{"$f":"P131","v":"4.a. Grass Channel A/B Soils"}]
[{"$f":"P132","v":"4.b. Grass Channel C/D Soils"},null,{"$f":"P132","v":"4.b. Grass Channel C/D Soils"},null,{"$f":"P132","v":"4.b. Grass Channel C/D Soils"},null,"4.b. Grass Channel C/D Soils",null,null,"4.b. Grass Channel C/D Soils",null,"4.b. Grass Channel C/D Soils"]
[{"$f":"P133","v":"4.c. Grass Channel Compost Amended Soils"},null,{"$f":"P133","v":"4.c. Grass Channel Compost Amended Soils"},null,{"$f":"P133","v":"4.c. Grass Channel Compost Amended Soils"},null,"4.c. Grass Channel Compost Amended Soils",null,null,"4.c. Grass Channel Compost Amended Soils",null,"4.c. Grass Channel Compost Amended Soils"]
[{"$f":"P135","v":"5.b. Dry Swale #2"},null,{"$f":"P134","v":"5.a. Dry Swale #1"},null,{"$f":"P134","v":"5.a. Dry Swale #1"},null,"5.a. Dry Swale #1",null,null,"5.a. Dry Swale #1",null,"5.a. Dry Swale #1"]
["6.a. Bioretention #1",null,{"$f":"P136","v":"6.a. Bioretention #1"},null,{"$f":"P135","v":"5.b. Dry Swale #2"},null,"5.b. Dry Swale #2",null,null,"5.b. Dry Swale #2",null,"5.b. Dry Swale #2"]
["6.b. Bioretention #2",null,"6.b. Bioretention #2",null,{"$f":"P137","v":"6.b. Bioretention #2"},null,"6.a. Bioretention #1",null,null,"6.a. Bioretention #1",null,"6.a. Bioretention #1"]
["7.a. Infiltration #1",null,"7.a. Infiltration #1",null,"7.a. Infiltration #1",null,{"$f":"P138","v":"7.a. Infiltration #1"},null,null,"6.b. Bioretention #2",null,"6.b. Bioretention #2"]
["7.b. Infiltration #2",null,"7.b. Infiltration #2",null,"7.b. Infiltration #2",null,"7.b. Infiltration #2",null,null,{"$f":"P139","v":"7.b. Infiltration #2"},null,"7.a. Infiltration #1"]
["8.a. ED #1",null,"8.a. ED #1",null,"8.a. ED #1",null,"8.a. ED #1",null,null,"8.a. ED #1",null,{"$f":"P140","v":"8.a. ED #1"}]
["8.b. ED #2",null,"8.b. ED #2",null,"8.b. ED #2",null,"8.b. ED #2",null,null,"8.b. ED #2",null,"8.b. ED #2"]
["9.a. Sheetflow to A/B Soil Conservation Area ",null,"9.a. Sheetflow to A/B Soil Conservation Area ",null,"9.a. Sheetflow to A/B Soil Conservation Area ",null,"9.a. Sheetflow to A/B Soil Conservation Area ",null,null,"9.a. Sheetflow to A/B Soil Conservation Area ",null,"9.a. Sheetflow to A/B Soil Conservation Area "]
["9.b. Sheetflow to C/D Soil Conservation Area",null,"9.b. Sheetflow to C/D Soil Conservation Area",null,"9.b. Sheetflow to C/D Soil Conservation Area",null,"9.b. Sheetflow to C/D Soil Conservation Area",null,null,"9.b. Sheetflow to C/D Soil Conservation Area",null,"9.b. Sheetflow to C/D Soil Conservation Area"]
["9.c. Sheetflow to Vegetated Filter Strip",null,"9.c. Sheetflow to Vegetated Filter Strip",null,"9.c. Sheetflow to Vegetated Filter Strip",null,"9.c. Sheetflow to Vegetated Filter Strip",null,null,"9.c. Sheetflow to Vegetated Filter Strip",null,"9.c. Sheetflow to Vegetated Filter Strip"]
["10.a. Wet Swale #1",null,"10.a. Wet Swale #1",null,"10.a. Wet Swale #1",null,"10.a. Wet Swale #1",null,null,"10.a. Wet Swale #1",null,"10.a. Wet Swale #1"]
["10.b. Wet Swale #2",null,"10.b. Wet Swale #2",null,"10.b. Wet Swale #2",null,"10.b. Wet Swale #2",null,null,"10.b. Wet Swale #2",null,"10.b. Wet Swale #2"]
["11.a. Filtering Practice #1",null,"11.a. Filtering Practice #1",null,"11.a. Filtering Practice #1",null,"11.a. Filtering Practice #1",null,null,"11.a. Filtering Practice #1",null,"11.a. Filtering Practice #1"]
["11.b. Filtering Practice #2",null,"11.b. Filtering Practice #2",null,"11.b. Filtering Practice #2",null,"11.b. Filtering Practice #2",null,null,"11.b. Filtering Practice #2",null,"11.b. Filtering Practice #2"]
["12.a. Constructed Wetland #1",null,"12.a. Constructed Wetland #1",null,"12.a. Constructed Wetland #1",null,"12.a. Constructed Wetland #1",null,null,"12.a. Constructed Wetland #1",null,"12.a. Constructed Wetland #1"]
["12.b. Constructed Wetland #2",null,"12.b. Constructed Wetland #2",null,"12.b. Constructed Wetland #2",null,"12.b. Constructed Wetland #2",null,null,"12.b. Constructed Wetland #2",null,"12.b. Constructed Wetland #2"]
["13.a. Wet Pond #1",null,"13.a. Wet Pond #1",null,"13.a. Wet Pond #1",null,"13.a. Wet Pond #1",null,null,"13.a. Wet Pond #1",null,"13.a. Wet Pond #1"]
["13.b. Wet Pond #1 (Coastal Plain)",null,"13.b. Wet Pond #1 (Coastal Plain)",null,"13.b. Wet Pond #1 (Coastal Plain)",null,"13.b. Wet Pond #1 (Coastal Plain)",null,null,"13.b. Wet Pond #1 (Coastal Plain)",null,"13.b. Wet Pond #1 (Coastal Plain)"]
["13.c. Wet Pond #2",null,"13.c. Wet Pond #2",null,"13.c. Wet Pond #2",null,"13.c. Wet Pond #2",null,null,"13.c. Wet Pond #2",null,"13.c. Wet Pond #2"]
["13.d. Wet Pond #2 (Coastal Plain)",null,"13.d. Wet Pond #2 (Coastal Plain)",null,"13.d. Wet Pond #2 (Coastal Plain)",null,"13.d. Wet Pond #2 (Coastal Plain)",null,null,"13.d. Wet Pond #2 (Coastal Plain)",null,"13.d. Wet Pond #2 (Coastal Plain)"]
["14.a. MTD - Hydrodynamic",null,"14.a. MTD - Hydrodynamic",null,"14.a. MTD - Hydrodynamic",null,"14.a. MTD - Hydrodynamic",null,null,"14.a. MTD - Hydrodynamic",null,"14.a. MTD - Hydrodynamic"]
["14.b. MTD - Filtering",null,"14.b. MTD - Filtering",null,"14.b. MTD - Filtering",null,"14.b. MTD - Filtering",null,null,"14.b. MTD - Filtering",null,"14.b. MTD - Filtering"]
["14.c. MTD - Generic",null,"14.c. MTD - Generic",null,"14.c. MTD - Generic",null,"14.c. MTD - Generic",null,null,"14.c. MTD - Generic",null,"14.c. MTD - Generic"]
[]
["Options for 8a. Extended Detention #1",null,"Options for 8b. Extended Detention #2",null,"Options for 9 Sheet Flow to Open Space",null,"Options for 9c. Sheet Flow to Filter Strip",null,null,"Options for 10a. Wet Swale #1",null,"Options for 10b. Wet Swale #2"]
[]
[{"$f":"P120","v":"None"},null,{"$f":"P120","v":"None"},null,{"$f":"P120","v":"None"},null,{"$f":"P120","v":"None"},null,null,{"$f":"P120","v":"None"},null,{"$f":"P120","v":"None"}]
[{"$f":"P131","v":"4.a. Grass Channel A/B Soils"},null,{"$f":"P131","v":"4.a. Grass Channel A/B Soils"},null,null,null,{"$f":"P131","v":"4.a. Grass Channel A/B Soils"},null,null,{"$f":"P131","v":"4.a. Grass Channel A/B Soils"},null,{"$f":"P131","v":"4.a. Grass Channel A/B Soils"}]
["4.b. Grass Channel C/D Soils",null,"4.b. Grass Channel C/D Soils",null,null,null,"4.b. Grass Channel C/D Soils",null,null,"4.b. Grass Channel C/D Soils",null,"4.b. Grass Channel C/D Soils"]
["4.c. Grass Channel Compost Amended Soils",null,"4.c. Grass Channel Compost Amended Soils",null,null,null,"4.c. Grass Channel Compost Amended Soils",null,null,"4.c. Grass Channel Compost Amended Soils",null,"4.c. Grass Channel Compost Amended Soils"]
["5.a. Dry Swale #1",null,"5.a. Dry Swale #1",null,null,null,"5.a. Dry Swale #1",null,null,"5.a. Dry Swale #1",null,"5.a. Dry Swale #1"]
["5.b. Dry Swale #2",null,"5.b. Dry Swale #2",null,null,null,"5.b. Dry Swale #2",null,null,"5.b. Dry Swale #2",null,"5.b. Dry Swale #2"]
["6.a. Bioretention #1",null,"6.a. Bioretention #1",null,null,null,"6.a. Bioretention #1",null,null,"6.a. Bioretention #1",null,"6.a. Bioretention #1"]
["6.b. Bioretention #2",null,"6.b. Bioretention #2",null,null,null,"6.b. Bioretention #2",null,null,"6.b. Bioretention #2",null,"6.b. Bioretention #2"]
["7.a. Infiltration #1",null,"7.a. Infiltration #1",null,null,null,"7.a. Infiltration #1",null,null,"7.a. Infiltration #1",null,"7.a. Infiltration #1"]
["7.b. Infiltration #2",null,"7.b. Infiltration #2",null,null,null,"7.b. Infiltration #2",null,null,"7.b. Infiltration #2",null,"7.b. Infiltration #2"]
[{"$f":"P141","v":"8.b. ED #2"},null,"8.a. ED #1",null,null,null,"8.a. ED #1",null,null,"8.a. ED #1",null,"8.a. ED #1"]
["9.a. Sheetflow to A/B Soil Conservation Area ",null,{"$f":"P142","v":"9.a. Sheetflow to A/B Soil Conservation Area "},null,null,null,"8.b. ED #2",null,null,"8.b. ED #2",null,"8.b. ED #2"]
["9.b. Sheetflow to C/D Soil Conservation Area",null,"9.b. Sheetflow to C/D Soil Conservation Area",null,null,null,"9.a. Sheetflow to A/B Soil Conservation Area ",null,null,"9.a. Sheetflow to A/B Soil Conservation Area ",null,"9.a. Sheetflow to A/B Soil Conservation Area "]
["9.c. Sheetflow to Vegetated Filter Strip",null,"9.c. Sheetflow to Vegetated Filter Strip",null,null,null,"9.b. Sheetflow to C/D Soil Conservation Area",null,null,"9.b. Sheetflow to C/D Soil Conservation Area",null,"9.b. Sheetflow to C/D Soil Conservation Area"]
["10.a. Wet Swale #1",null,"10.a. Wet Swale #1",null,null,null,{"$f":"P145","v":"10.a. Wet Swale #1"},null,null,"9.c. Sheetflow to Vegetated Filter Strip",null,"9.c. Sheetflow to Vegetated Filter Strip"]
["10.b. Wet Swale #2",null,"10.b. Wet Swale #2",null,null,null,"10.b. Wet Swale #2",null,null,{"$f":"P146","v":"10.b. Wet Swale #2"},null,"10.a. Wet Swale #1"]
["11.a. Filtering Practice #1",null,"11.a. Filtering Practice #1",null,null,null,"11.a. Filtering Practice #1",null,null,"11.a. Filtering Practice #1",null,{"$f":"P147","v":"11.a. Filtering Practice #1"}]
["11.b. Filtering Practice #2",null,"11.b. Filtering Practice #2",null,null,null,"11.b. Filtering Practice #2",null,null,"11.b. Filtering Practice #2",null,"11.b. Filtering Practice #2"]
["12.a. Constructed Wetland #1",null,"12.a. Constructed Wetland #1",null,null,null,"12.a. Constructed Wetland #1",null,null,"12.a. Constructed Wetland #1",null,"12.a. Constructed Wetland #1"]
["12.b. Constructed Wetland #2",null,"12.b. Constructed Wetland #2",null,null,null,"12.b. Constructed Wetland #2",null,null,"12.b. Constructed Wetland #2",null,"12.b. Constructed Wetland #2"]
["13.a. Wet Pond #1",null,"13.a. Wet Pond #1",null,null,null,"13.a. Wet Pond #1",null,null,"13.a. Wet Pond #1",null,"13.a. Wet Pond #1"]
["13.b. Wet Pond #1 (Coastal Plain)",null,"13.b. Wet Pond #1 (Coastal Plain)",null,null,null,"13.b. Wet Pond #1 (Coastal Plain)",null,null,"13.b. Wet Pond #1 (Coastal Plain)",null,"13.b. Wet Pond #1 (Coastal Plain)"]
["13.c. Wet Pond #2",null,"13.c. Wet Pond #2",null,null,null,"13.c. Wet Pond #2",null,null,"13.c. Wet Pond #2",null,"13.c. Wet Pond #2"]
["13.d. Wet Pond #2 (Coastal Plain)",null,"13.d. Wet Pond #2 (Coastal Plain)",null,null,null,"13.d. Wet Pond #2 (Coastal Plain)",null,null,"13.d. Wet Pond #2 (Coastal Plain)",null,"13.d. Wet Pond #2 (Coastal Plain)"]
["14.a. MTD - Hydrodynamic",null,"14.a. MTD - Hydrodynamic",null,null,null,"14.a. MTD - Hydrodynamic",null,null,"14.a. MTD - Hydrodynamic",null,"14.a. MTD - Hydrodynamic"]
["14.b. MTD - Filtering",null,"14.b. MTD - Filtering",null,null,null,"14.b. MTD - Filtering",null,null,"14.b. MTD - Filtering",null,"14.b. MTD - Filtering"]
["14.c. MTD - Generic",null,"14.c. MTD - Generic",null,null,null,"14.c. MTD - Generic",null,null,"14.c. MTD - Generic",null,"14.c. MTD - Generic"]
[]
[null,null,null,null,"Options for 12.a.  Constructed Wetland #1",null,"Options for 12.b.  Constructed Wetland #2"]
["Options for 11 A.  Filtering Practice #1",null,"Options for 11 b.  Filtering Practice #2",null,null,null,null,null,null,"Options for 13.a.  Wet Pond #1"]
[null,null,null,null,{"$f":"P120","v":"None"},null,{"$f":"P120","v":"None"},null,null,{"$f":"P120","v":"None"},null,"Options for 13.b.  Wet Pond #1 (Coastal Plain)"]
[{"$f":"P120","v":"None"},null,{"$f":"P120","v":"None"},null,{"$f":"P131","v":"4.a. Grass Channel A/B Soils"},null,{"$f":"P131","v":"4.a. Grass Channel A/B Soils"},null,null,{"$f":"P131","v":"4.a. Grass Channel A/B Soils"},null,{"$f":"P120","v":"None"}]
[{"$f":"P131","v":"4.a. Grass Channel A/B Soils"},null,{"$f":"P131","v":"4.a. Grass Channel A/B Soils"},null,"4.b. Grass Channel C/D Soils",null,"4.b. Grass Channel C/D Soils",null,null,"4.b. Grass Channel C/D Soils",null,{"$f":"P131","v":"4.a. Grass Channel A/B Soils"}]
["4.b. Grass Channel C/D Soils",null,"4.b. Grass Channel C/D Soils",null,"4.c. Grass Channel Compost Amended Soils",null,"4.c. Grass Channel Compost Amended Soils",null,null,"4.c. Grass Channel Compost Amended Soils",null,"4.b. Grass Channel C/D Soils"]
["4.c. Grass Channel Compost Amended Soils",null,"4.c. Grass Channel Compost Amended Soils",null,"5.a. Dry Swale #1",null,"5.a. Dry Swale #1",null,null,"5.a. Dry Swale #1",null,"4.c. Grass Channel Compost Amended Soils"]
["5.a. Dry Swale #1",null,"5.a. Dry Swale #1",null,"5.b. Dry Swale #2",null,"5.b. Dry Swale #2",null,null,"5.b. Dry Swale #2",null,"5.a. Dry Swale #1"]
["5.b. Dry Swale #2",null,"5.b. Dry Swale #2",null,"6.a. Bioretention #1",null,"6.a. Bioretention #1",null,null,"6.a. Bioretention #1",null,"5.b. Dry Swale #2"]
["6.a. Bioretention #1",null,"6.a. Bioretention #1",null,"6.b. Bioretention #2",null,"6.b. Bioretention #2",null,null,"6.b. Bioretention #2",null,"6.a. Bioretention #1"]
["6.b. Bioretention #2",null,"6.b. Bioretention #2",null,"7.a. Infiltration #1",null,"7.a. Infiltration #1",null,null,"7.a. Infiltration #1",null,"6.b. Bioretention #2"]
["7.a. Infiltration #1",null,"7.a. Infiltration #1",null,"7.b. Infiltration #2",null,"7.b. Infiltration #2",null,null,"7.b. Infiltration #2",null,"7.a. Infiltration #1"]
["7.b. Infiltration #2",null,"7.b. Infiltration #2",null,"8.a. ED #1",null,"8.a. ED #1",null,null,"8.a. ED #1",null,"7.b. Infiltration #2"]
["8.a. ED #1",null,"8.a. ED #1",null,"8.b. ED #2",null,"8.b. ED #2",null,null,"8.b. ED #2",null,"8.a. ED #1"]
["8.b. ED #2",null,"8.b. ED #2",null,"9.a. Sheetflow to A/B Soil Conservation Area ",null,"9.a. Sheetflow to A/B Soil Conservation Area ",null,null,"9.a. Sheetflow to A/B Soil Conservation Area ",null,"8.b. ED #2"]
["9.a. Sheetflow to A/B Soil Conservation Area ",null,"9.a. Sheetflow to A/B Soil Conservation Area ",null,"9.b. Sheetflow to C/D Soil Conservation Area",null,"9.b. Sheetflow to C/D Soil Conservation Area",null,null,"9.b. Sheetflow to C/D Soil Conservation Area",null,"9.a. Sheetflow to A/B Soil Conservation Area "]
["9.b. Sheetflow to C/D Soil Conservation Area",null,"9.b. Sheetflow to C/D Soil Conservation Area",null,"9.c. Sheetflow to Vegetated Filter Strip",null,"9.c. Sheetflow to Vegetated Filter Strip",null,null,"9.c. Sheetflow to Vegetated Filter Strip",null,"9.b. Sheetflow to C/D Soil Conservation Area"]
["9.c. Sheetflow to Vegetated Filter Strip",null,"9.c. Sheetflow to Vegetated Filter Strip",null,"10.a. Wet Swale #1",null,"10.a. Wet Swale #1",null,null,"10.a. Wet Swale #1",null,"9.c. Sheetflow to Vegetated Filter Strip"]
["10.a. Wet Swale #1",null,"10.a. Wet Swale #1",null,"10.b. Wet Swale #2",null,"10.b. Wet Swale #2",null,null,"10.b. Wet Swale #2",null,"10.a. Wet Swale #1"]
["10.b. Wet Swale #2",null,"10.b. Wet Swale #2",null,"11.a. Filtering Practice #1",null,"11.a. Filtering Practice #1",null,null,"11.a. Filtering Practice #1",null,"10.b. Wet Swale #2"]
[{"$f":"P148","v":"11.b. Filtering Practice #2"},null,"11.a. Filtering Practice #1",null,"11.b. Filtering Practice #2",null,"11.b. Filtering Practice #2",null,null,"11.b. Filtering Practice #2",null,"11.a. Filtering Practice #1"]
["12.a. Constructed Wetland #1",null,{"$f":"P149","v":"12.a. Constructed Wetland #1"},null,{"$f":"P150","v":"12.b. Constructed Wetland #2"},null,"12.a. Constructed Wetland #1",null,null,"12.a. Constructed Wetland #1",null,"11.b. Filtering Practice #2"]
["12.b. Constructed Wetland #2",null,"12.b. Constructed Wetland #2",null,"13.a. Wet Pond #1",null,{"$f":"P151","v":"13.a. Wet Pond #1"},null,null,"12.b. Constructed Wetland #2",null,"12.a. Constructed Wetland #1"]
["13.a. Wet Pond #1",null,"13.a. Wet Pond #1",null,"13.b. Wet Pond #1 (Coastal Plain)",null,"13.b. Wet Pond #1 (Coastal Plain)",null,null,{"$f":"P153","v":"13.c. Wet Pond #2"},null,"12.b. Constructed Wetland #2"]
["13.b. Wet Pond #1 (Coastal Plain)",null,"13.b. Wet Pond #1 (Coastal Plain)",null,"13.c. Wet Pond #2",null,"13.c. Wet Pond #2",null,null,{"$f":"P155","v":"14.a. MTD - Hydrodynamic"},null,{"$f":"P154","v":"13.d. Wet Pond #2 (Coastal Plain)"}]
["13.c. Wet Pond #2",null,"13.c. Wet Pond #2",null,"13.d. Wet Pond #2 (Coastal Plain)",null,"13.d. Wet Pond #2 (Coastal Plain)",null,null,{"$f":"P156","v":"14.b. MTD - Filtering"},null,{"$f":"P155","v":"14.a. MTD - Hydrodynamic"}]
["13.d. Wet Pond #2 (Coastal Plain)",null,"13.d. Wet Pond #2 (Coastal Plain)",null,"14.a. MTD - Hydrodynamic",null,"14.a. MTD - Hydrodynamic",null,null,{"$f":"P157","v":"14.c. MTD - Generic"},null,{"$f":"P156","v":"14.b. MTD - Filtering"}]
["14.a. MTD - Hydrodynamic",null,"14.a. MTD - Hydrodynamic",null,"14.b. MTD - Filtering",null,"14.b. MTD - Filtering",null,null,null,null,{"$f":"P157","v":"14.c. MTD - Generic"}]
["14.b. MTD - Filtering",null,"14.b. MTD - Filtering",null,"14.c. MTD - Generic",null,"14.c. MTD - Generic"]
["14.c. MTD - Generic",null,"14.c. MTD - Generic"]
[]
[]
["Options for 13.c.  Wet Pond #2",null,"Options for 13.d.  Wet Pond #2 (Coastal Plain)",null,"Options for 14.a.  Manufactured Device-Hydrodynamic",null,"Options for 14.b.  Manufactured Device-Filtering",null,null,null,"Options for 14.c.  Manufactured Device-Generic"]
[]
[{"$f":"P120","v":"None"},null,{"$f":"P120","v":"None"},null,{"$f":"P120","v":"None"},null,{"$f":"P120","v":"None"},null,null,null,{"$f":"P120","v":"None"}]
[{"$f":"P131","v":"4.a. Grass Channel A/B Soils"},null,{"$f":"P131","v":"4.a. Grass Channel A/B Soils"},null,{"$f":"P131","v":"4.a. Grass Channel A/B Soils"},null,{"$f":"P131","v":"4.a. Grass Channel A/B Soils"},null,null,null,{"$f":"P131","v":"4.a. Grass Channel A/B Soils"}]
["4.b. Grass Channel C/D Soils",null,"4.b. Grass Channel C/D Soils",null,"4.b. Grass Channel C/D Soils",null,"4.b. Grass Channel C/D Soils",null,null,null,"4.b. Grass Channel C/D Soils"]
["4.c. Grass Channel Compost Amended Soils",null,"4.c. Grass Channel Compost Amended Soils",null,"4.c. Grass Channel Compost Amended Soils",null,"4.c. Grass Channel Compost Amended Soils",null,null,null,"4.c. Grass Channel Compost Amended Soils"]
["5.a. Dry Swale #1",null,"5.a. Dry Swale #1",null,"5.a. Dry Swale #1",null,"5.a. Dry Swale #1",null,null,null,"5.a. Dry Swale #1"]
["5.b. Dry Swale #2",null,"5.b. Dry Swale #2",null,"5.b. Dry Swale #2",null,"5.b. Dry Swale #2",null,null,null,"5.b. Dry Swale #2"]
["6.a. Bioretention #1",null,"6.a. Bioretention #1",null,"6.a. Bioretention #1",null,"6.a. Bioretention #1",null,null,null,"6.a. Bioretention #1"]
["6.b. Bioretention #2",null,"6.b. Bioretention #2",null,"6.b. Bioretention #2",null,"6.b. Bioretention #2",null,null,null,"6.b. Bioretention #2"]
["7.a. Infiltration #1",null,"7.a. Infiltration #1",null,"7.a. Infiltration #1",null,"7.a. Infiltration #1",null,null,null,"7.a. Infiltration #1"]
["7.b. Infiltration #2",null,"7.b. Infiltration #2",null,"7.b. Infiltration #2",null,"7.b. Infiltration #2",null,null,null,"7.b. Infiltration #2"]
["8.a. ED #1",null,"8.a. ED #1",null,"8.a. ED #1",null,"8.a. ED #1",null,null,null,"8.a. ED #1"]
["8.b. ED #2",null,"8.b. ED #2",null,"8.b. ED #2",null,"8.b. ED #2",null,null,null,"8.b. ED #2"]
["9.a. Sheetflow to A/B Soil Conservation Area ",null,"9.a. Sheetflow to A/B Soil Conservation Area ",null,"9.a. Sheetflow to A/B Soil Conservation Area ",null,"9.a. Sheetflow to A/B Soil Conservation Area ",null,null,null,"9.a. Sheetflow to A/B Soil Conservation Area "]
["9.b. Sheetflow to C/D Soil Conservation Area",null,"9.b. Sheetflow to C/D Soil Conservation Area",null,"9.b. Sheetflow to C/D Soil Conservation Area",null,"9.b. Sheetflow to C/D Soil Conservation Area",null,null,null,"9.b. Sheetflow to C/D Soil Conservation Area"]
["9.c. Sheetflow to Vegetated Filter Strip",null,"9.c. Sheetflow to Vegetated Filter Strip",null,"9.c. Sheetflow to Vegetated Filter Strip",null,"9.c. Sheetflow to Vegetated Filter Strip",null,null,null,"9.c. Sheetflow to Vegetated Filter Strip"]
["10.a. Wet Swale #1",null,"10.a. Wet Swale #1",null,"10.a. Wet Swale #1",null,"10.a. Wet Swale #1",null,null,null,"10.a. Wet Swale #1"]
["10.b. Wet Swale #2",null,"10.b. Wet Swale #2",null,"10.b. Wet Swale #2",null,"10.b. Wet Swale #2",null,null,null,"10.b. Wet Swale #2"]
["11.a. Filtering Practice #1",null,"11.a. Filtering Practice #1",null,"11.a. Filtering Practice #1",null,"11.a. Filtering Practice #1",null,null,null,"11.a. Filtering Practice #1"]
["11.b. Filtering Practice #2",null,"11.b. Filtering Practice #2",null,"11.b. Filtering Practice #2",null,"11.b. Filtering Practice #2",null,null,null,"11.b. Filtering Practice #2"]
["12.a. Constructed Wetland #1",null,"12.a. Constructed Wetland #1",null,"12.a. Constructed Wetland #1",null,"12.a. Constructed Wetland #1",null,null,null,"12.a. Constructed Wetland #1"]
["12.b. Constructed Wetland #2",null,"12.b. Constructed Wetland #2",null,"12.b. Constructed Wetland #2",null,"12.b. Constructed Wetland #2",null,null,null,"12.b. Constructed Wetland #2"]
["13.a. Wet Pond #1",null,{"$f":"P152","v":"13.b. Wet Pond #1 (Coastal Plain)"},null,"13.a. Wet Pond #1",null,"13.a. Wet Pond #1",null,null,null,"13.a. Wet Pond #1"]
[{"$f":"P155","v":"14.a. MTD - Hydrodynamic"},null,{"$f":"P155","v":"14.a. MTD - Hydrodynamic"},null,"13.b. Wet Pond #1 (Coastal Plain)",null,"13.b. Wet Pond #1 (Coastal Plain)",null,null,null,"13.b. Wet Pond #1 (Coastal Plain)"]
[{"$f":"P156","v":"14.b. MTD - Filtering"},null,{"$f":"P156","v":"14.b. MTD - Filtering"},null,"13.c. Wet Pond #2",null,"13.c. Wet Pond #2",null,null,null,"13.c. Wet Pond #2"]
[{"$f":"P157","v":"14.c. MTD - Generic"},null,{"$f":"P157","v":"14.c. MTD - Generic"},null,"13.d. Wet Pond #2 (Coastal Plain)",null,"13.d. Wet Pond #2 (Coastal Plain)",null,null,null,"13.d. Wet Pond #2 (Coastal Plain)"]
[null,null,null,null,{"$f":"P156","v":"14.b. MTD - Filtering"}]

{"sheet":"D.A. E","index":5,"n_rows":278,"n_cols":27,"rows_kept":278,"cut":false,"hidden":false,"merged":[[13,13,13,14],[0,3,0,4],[6,8,6,11],[7,8,7,11],[10,13,10,14],[12,13,12,14],[31,13,31,14],[16,13,16,14],[17,13,17,14],[18,13,18,14],[19,13,19,14],[20,13,20,14],[21,13,21,14],[22,13,22,14],[23,13,23,14],[24,13,24,14],[27,13,27,14],[28,13,28,14],[54,13,54,14],[51,16,51,19],[52,13,52,14],[32,13,32,14],[33,13,33,14],[36,13,36,14],[37,13,37,14],[40,13,40,14],[41,13,41,14],[44,13,44,14],[45,13,45,14],[48,13,48,14],[49,13,49,14],[53,13,53,14],[69,1,69,2],[69,15,69,16],[70,17,70,19],[88,0,88,1],[88,17,88,19],[72,13,72,14],[74,16,74,18],[75,13,75,14],[76,13,76,14],[79,13,79,14],[80,13,80,14],[71,13,71,14],[89,13,89,14],[90,13,90,14],[91,13,91,14],[82,16,82,17],[83,13,83,14],[84,13,84,14],[85,13,85,14],[86,13,86,14]]}
["Drainage Area E"]
[null,null,null,null,null,null,null,null,null,null,null,null,null,null,null,null,null,null,null,null,null,null,null,null,"Check Areas!",null,"CHECK AREAS!"]
["Drainage Area A Land Cover  (acres)",{"$f":"IF($F$8>Site!$F$27,\"Drainage area is greater than site area!\",(IF(OR(F5>Site!F24,F6>Site!F25,F7>Site!F26),\"Check Site Tab land cover areas!\",\"\")))","v":""}]
[null,"A Soils","B Soils","C Soils","D Soils","Totals","Land Cover Rv",null,null,null,null,null,null,"`"]
["Forest/Open Space (acres)",null,null,null,null,{"$f":"SUMIF(B5:E5,\">=0\")","v":0},{"$f":"IF(F5>0,(B5*Site!E32+C5*Site!F32+D5*Site!G32+E5*Site!H32)/F5,0)","v":0}]
["Managed Turf (acres)",null,null,null,null,{"$f":"SUMIF(B6:E6,\">=0\")","v":0},{"$f":"IF(F6>0,(B6*Site!E33+C6*Site!F33+D6*Site!G33+E6*Site!H33)/F6,0)","v":0}]
["Impervious Cover (acres) ",null,null,null,null,{"$f":"SUMIF(B7:E7,\">=0\")","v":0},{"$f":"IF(F7>0,((B7*Site!E34+C7*Site!F34+D7*Site!G34+E7*Site!H34)/F7),0)","v":0},null,"     Total Phosphorus Available for Removal in D.A. E (lb/yr)",null,null,null,{"$f":"Site!$B$31*Site!$B$36*($M$8/Site!$B$32)*Site!$B$33*2.72/43560","v":0}]
[null,null,null,null,"Total",{"$f":"SUM(F5:F7)","v":0},null,null,"Post Development Treatment Volume in D.A. E (ft3)",null,null,null,{"$f":"IFERROR(Site!B32/12*(F6*G6+F7*G7)/(F6+F7)*(F6+F7)*43560,0)","v":0}]
[]
["Stormwater Best Management Practices (RR = Runoff Reduction)",null,null,null,null,null,null,null,null,null,null,null,null,"--Select from dropdown lists--"]
["Practice","Runoff Reduction Credit (%)","Managed Turf Credit Area (acres) ","Impervious Cover Credit Area (acres)","Volume from Upstream Practice (ft3)","Runoff Reduction (ft3)","Remaining Runoff Volume  (ft3)","Total BMP Treatment Volume (ft3)","Phosphorus Removal Efficiency (%)","Phosphorus Load from Upstream Practices (lb)","Untreated Phosphorus Load to Practice (lb)","Phosphorus Removed By Practice (lb)","Remaining Phosphorus Load (lb)","Downstream Practice to be Employed",null,null,"Nitrogen Removal Efficiency (%)","Nitrogen Load from Upstream  Practices (lbs)","Untreated Nitrogen Load to Practice (lbs)","Nitrogen Removed By Practice (lbs)","Remaining Nitrogen Load (lbs)"]
["1. Vegetated Roof (RR)",null,null,null,null,null,null,null,null,null,null,null,null,null,null,null,"1. Vegetated Roof (RR)"]
["1.a. Vegetated Roof #1 (Spec #5)",45,null,null,null,{"$f":"(Site!$B$32*($G$7*$D13)*3630)*$B13/100","v":0},{"$f":"(Site!$B$32*($G$7*$D13)*3630)*(1-$B13/100)","v":0},{"$f":"+$F13+$G13","v":0},0,null,{"$f":"(Site!$B$32*($G$7*$D13)*3630)*Site!$B$33*0.3048^3/454*Site!$B$31/Site!$B$32*Site!$B$36","v":0},{"$f":"IFERROR($K13*($F13+$G13*$I13/100)/($H13),0)","v":0},{"$f":"$K13-$L13","v":0},null,null,null,0,null,{"$f":"(Site!$B$32*$G$7*$D13*3630)*Site!$B$34*0.3048^3/454*Site!$B$31/Site!$B$32*Site!$B$36","v":0},{"$f":"IFERROR($S13*($F13+$G13*$Q13/100)/$H13,0)","v":0},{"$f":"$S13-$T13","v":0}]
["1.b. Vegetated Roof #2 (Spec #5)",60,null,null,null,{"$f":"(Site!$B$32*($G$7*$D14)*3630)*$B14/100","v":0},{"$f":"(Site!$B$32*($G$7*$D14)*3630)*(1-$B14/100)","v":0},{"$f":"+$F14+$G14","v":0},0,null,{"$f":"(Site!$B$32*($G$7*$D14)*3630)*Site!$B$33*0.3048^3/454*Site!$B$31/Site!$B$32*Site!$B$36","v":0},{"$f":"IFERROR($K14*($F14+$G14*$I14/100)/($H14),0)","v":0},{"$f":"$K14-$L14","v":0},null,null,null,0,null,{"$f":"(Site!$B$32*$G$7*$D14*3630)*Site!$B$34*0.3048^3/454*Site!$B$31/Site!$B$32*Site!$B$36","v":0},{"$f":"IFERROR($S14*($F14+$G14*$Q14/100)/$H14,0)","v":0},{"$f":"$S14-$T14","v":0}]
[]
["2. Rooftop Disconnection (RR)",null,null,null,null,null,null,null,null,null,null,null,null,null,null,null,"2. Rooftop Disconnection (RR)"]
["2.a. Simple Disconnection to A/B Soils \n(Spec #1)",50,null,null,{"$f":"SUMIF($N$13:$N$92,$P121,$G$13:$G$92)","v":0},{"$f":"(Site!$B$32*($G$6*$C17+$G$7*$D17)*3630+$E17)*$B17/100","v":0},{"$f":"(Site!$B$32*($G$6*$C17+$G$7*$D17)*3630+$E17)*(1-$B17/100)","v":0},{"$f":"+$F17+$G17","v":0},0,{"$f":"SUMIF($N$13:$N$92,$P121,$M$13:$M$92)","v":0},{"$f":"(Site!$B$32*($G$6*$C17+$G$7*$D17)*3630)*Site!$B$33*0.3048^3/454*Site!$B$31/Site!$B$32*Site!$B$36","v":0},{"$f":"IFERROR(($J17+$K17)*($F17+$G17*$I17/100)/$H17,0)","v":0},{"$f":"$J17+$K17-$L17","v":0},null,null,null,0,{"$f":"SUMIF($N$13:$N$92,$P121,$U$13:$U$92)","v":0},{"$f":"(Site!$B$32*$G$7*$D17*3630)*Site!$B$34*0.3048^3/454*Site!$B$31/Site!$B$32*Site!$B$36","v":0},{"$f":"IFERROR(($R17+$S17)*($F17+$G17*$Q17/100)/$H17,0)","v":0},{"$f":"$R17+$S17-$T17","v":0}]
["2.b. Simple Disconnection to C/D Soils \n(Spec #1)",25,null,null,{"$f":"SUMIF($N$13:$N$92,$P122,$G$13:$G$92)","v":0},{"$f":"(Site!$B$32*($G$6*$C18+$G$7*$D18)*3630+$E18)*$B18/100","v":0},{"$f":"(Site!$B$32*($G$6*$C18+$G$7*$D18)*3630+$E18)*(1-$B18/100)","v":0},{"$f":"+$F18+$G18","v":0},0,{"$f":"SUMIF($N$13:$N$92,$P122,$M$13:$M$92)","v":0},{"$f":"(Site!$B$32*($G$6*$C18+$G$7*$D18)*3630)*Site!$B$33*0.3048^3/454*Site!$B$31/Site!$B$32*Site!$B$36","v":0},{"$f":"IFERROR(($J18+$K18)*($F18+$G18*$I18/100)/$H18,0)","v":0},0,null,null,null,0,{"$f":"SUMIF($N$13:$N$92,$P122,$U$13:$U$92)","v":0},{"$f":"(Site!$B$32*$G$7*$D18*3630)*Site!$B$34*0.3048^3/454*Site!$B$31/Site!$B$32*Site!$B$36","v":0},{"$f":"IFERROR(($R18+$S18)*($F18+$G18*$Q18/100)/$H18,0)","v":0},0]
["2.c. To Soil Amended Filter Path as per specifications (existing C/D soils) (Spec #4)",50,null,null,0,{"$f":"(Site!$B$32*($G$6*$C19+$G$7*$D19)*3630+$E19)*$B19/100","v":0},{"$f":"(Site!$B$32*($G$6*$C19+$G$7*$D19)*3630+$E19)*(1-$B19/100)","v":0},0,0,0,{"$f":"(Site!$B$32*($G$6*$C19+$G$7*$D19)*3630)*Site!$B$33*0.3048^3/454*Site!$B$31/Site!$B$32*Site!$B$36","v":0},0,0,null,null,null,0,0,{"$f":"(Site!$B$32*$G$7*$D19*3630)*Site!$B$34*0.3048^3/454*Site!$B$31/Site!$B$32*Site!$B$36","v":0},0,0]
["2.d. To Dry Well or French Drain #1, \nMicro-Infilration #1 (Spec #8)",50,null,null,0,{"$f":"(Site!$B$32*($G$6*$C20+$G$7*$D20)*3630+$E20)*$B20/100","v":0},{"$f":"(Site!$B$32*($G$6*$C20+$G$7*$D20)*3630+$E20)*(1-$B20/100)","v":0},0,25,0,{"$f":"(Site!$B$32*($G$6*$C20+$G$7*$D20)*3630)*Site!$B$33*0.3048^3/454*Site!$B$31/Site!$B$32*Site!$B$36","v":0},0,0,null,null,null,15,0,{"$f":"(Site!$B$32*$G$7*$D20*3630)*Site!$B$34*0.3048^3/454*Site!$B$31/Site!$B$32*Site!$B$36","v":0},0,0]
["2.e. To Dry Well or French Drain #2, \nMicro-Infiltration #2 (Spec #8)",90,null,null,0,{"$f":"(Site!$B$32*($G$6*$C21+$G$7*$D21)*3630+$E21)*$B21/100","v":0},{"$f":"(Site!$B$32*($G$6*$C21+$G$7*$D21)*3630+$E21)*(1-$B21/100)","v":0},0,25,0,{"$f":"(Site!$B$32*($G$6*$C21+$G$7*$D21)*3630)*Site!$B$33*0.3048^3/454*Site!$B$31/Site!$B$32*Site!$B$36","v":0},0,0,null,null,null,15,0,{"$f":"(Site!$B$32*$G$7*$D21*3630)*Site!$B$34*0.3048^3/454*Site!$B$31/Site!$B$32*Site!$B$36","v":0},0,0]
["2.f. To Rain Garden #1, \nMicro-Bioretention #1 (Spec #9)",40,null,null,0,{"$f":"(Site!$B$32*($G$6*$C22+$G$7*$D22)*3630+$E22)*$B22/100","v":0},{"$f":"(Site!$B$32*($G$6*$C22+$G$7*$D22)*3630+$E22)*(1-$B22/100)","v":0},0,25,0,{"$f":"(Site!$B$32*($G$6*$C22+$G$7*$D22)*3630)*Site!$B$33*0.3048^3/454*Site!$B$31/Site!$B$32*Site!$B$36","v":0},0,0,null,null,null,40,0,{"$f":"(Site!$B$32*$G$7*$D22*3630)*Site!$B$34*0.3048^3/454*Site!$B$31/Site!$B$32*Site!$B$36","v":0},0,0]
["2.g. To Rain Garden #2, \nMicro-Bioretention #2 (Spec #9)",80,null,null,0,{"$f":"(Site!$B$32*($G$6*$C23+$G$7*$D23)*3630+$E23)*$B23/100","v":0},{"$f":"(Site!$B$32*($G$6*$C23+$G$7*$D23)*3630+$E23)*(1-$B23/100)","v":0},0,50,0,{"$f":"(Site!$B$32*($G$6*$C23+$G$7*$D23)*3630)*Site!$B$33*0.3048^3/454*Site!$B$31/Site!$B$32*Site!$B$36","v":0},0,0,null,null,null,60,0,{"$f":"(Site!$B$32*$G$7*$D23*3630)*Site!$B$34*0.3048^3/454*Site!$B$31/Site!$B$32*Site!$B$36","v":0},0,0]
["2.h. To Rainwater Harvesting (Spec #6)",0,null,null,0,{"$f":"(Site!$B$32*($G$6*$C24+$G$7*$D24)*3630+$E24)*$B24/100","v":0},{"$f":"(Site!$B$32*($G$6*$C24+$G$7*$D24)*3630+$E24)*(1-$B24/100)","v":0},0,0,0,{"$f":"(Site!$B$32*($G$6*$C24+$G$7*$D24)*3630)*Site!$B$33*0.3048^3/454*Site!$B$31/Site!$B$32*Site!$B$36","v":0},0,0,null,null,null,0,0,{"$f":"(Site!$B$32*$G$7*$D24*3630)*Site!$B$34*0.3048^3/454*Site!$B$31/Site!$B$32*Site!$B$36","v":0},0,0]
["2.i. To Stormwater Planter, \nUrban Bioretention (Spec #9, Appendix A)",40,null,null,0,{"$f":"(Site!$B$32*($G$6*$C25+$G$7*$D25)*3630+$E25)*$B25/100","v":0},{"$f":"(Site!$B$32*($G$6*$C25+$G$7*$D25)*3630+$E25)*(1-$B25/100)","v":0},0,25,0,{"$f":"(Site!$B$32*($G$6*$C25+$G$7*$D25)*3630)*Site!$B$33*0.3048^3/454*Site!$B$31/Site!$B$32*Site!$B$36","v":0},0,0,null,null,null,40,0,{"$f":"(Site!$B$32*$G$7*$D25*3630)*Site!$B$34*0.3048^3/454*Site!$B$31/Site!$B$32*Site!$B$36","v":0},0,0]
[]
["3. Permeable Pavement  (RR)",null,null,null,null,null,null,null,null,null,null,null,null,null,null,null,"3. Permeable Pavement  (RR)"]
["3.a. Permeable Pavement #1 (Spec #7)",45,null,null,{"$f":"SUMIF($N$13:$N$92,$P130,$G$13:$G$92)","v":0},{"$f":"(Site!$B$32*($G$6*$C28+$G$7*$D28)*3630+$E28)*$B28/100","v":0},{"$f":"(Site!$B$32*($G$6*$C28+$G$7*$D28)*3630+$E28)*(1-$B28/100)","v":0},{"$f":"+$F28+$G28","v":0},25,{"$f":"SUMIF($N$13:$N$92,$P130,$M$13:$M$92)","v":0},{"$f":"(Site!$B$32*($G$6*$C28+$G$7*$D28)*3630)*Site!$B$33*0.3048^3/454*Site!$B$31/Site!$B$32*Site!$B$36","v":0},{"$f":"IFERROR(($J28+$K28)*($F28+$G28*$I28/100)/$H28,0)","v":0},{"$f":"$J28+$K28-$L28","v":0},null,null,null,25,{"$f":"SUMIF($N$13:$N$92,$P130,$U$13:$U$92)","v":0},{"$f":"(Site!$B$32*($G$6*$C28+$G$7*$D28)*3630)*Site!$B$34*0.3048^3/454*Site!$B$31/Site!$B$32*Site!$B$36","v":0},{"$f":"IFERROR(($R28+$S28)*($F28+$G28*$Q28/100)/$H28,0)","v":0},{"$f":"$R28+$S28-$T28","v":0}]
["3.b. Permeable Pavement #2 (Spec #7)",75,null,null,null,{"$f":"(Site!$B$32*($G$6*$C29+$G$7*$D29)*3630+$E29)*$B29/100","v":0},{"$f":"(Site!$B$32*($G$6*$C29+$G$7*$D29)*3630+$E29)*(1-$B29/100)","v":0},{"$f":"+$F29+$G29","v":0},25,null,{"$f":"(Site!$B$32*($G$6*$C29+$G$7*$D29)*3630)*Site!$B$33*0.3048^3/454*Site!$B$31/Site!$B$32*Site!$B$36","v":0},{"$f":"IFERROR(($J29+$K29)*($F29+$G29*$I29/100)/$H29,0)","v":0},{"$f":"$K29-$L29","v":0},null,null,null,25,null,{"$f":"(Site!$B$32*$G$7*$D29*3630)*Site!$B$34*0.3048^3/454*Site!$B$31/Site!$B$32*Site!$B$36","v":0},{"$f":"IFERROR(($R29+$S29)*($F29+$G29*$Q29/100)/$H29,0)","v":0},{"$f":"$R29+$S29-$T29","v":0}]
[]
["4. Grass Channel (RR)",null,null,null,null,null,null,null,null,null,null,null,null,null,null,null,"4. Grass Channel (RR)"]
["4.a. Grass Channel A/B Soils (Spec #3)",20,null,null,{"$f":"SUMIF($N$13:$N$92,$P131,$G$13:$G$92)","v":0},{"$f":"(Site!$B$32*($G$6*$C32+$G$7*$D32)*3630+$E32)*$B32/100","v":0},{"$f":"(Site!$B$32*($G$6*$C32+$G$7*$D32)*3630+$E32)*(1-$B32/100)","v":0},{"$f":"+$F32+$G32","v":0},15,{"$f":"SUMIF($N$13:$N$92,$P131,$M$13:$M$92)","v":0},{"$f":"(Site!$B$32*($G$6*$C32+$G$7*$D32)*3630)*Site!$B$33*0.3048^3/454*Site!$B$31/Site!$B$32*Site!$B$36","v":0},{"$f":"IFERROR(($J32+$K32)*($F32+$G32*$I32/100)/$H32,0)","v":0},{"$f":"$J32+$K32-$L32","v":0},null,null,null,20,{"$f":"SUMIF($N$13:$N$92,$P131,$U$13:$U$92)","v":0},{"$f":"(Site!$B$32*($G$6*$C32+$G$7*$D32)*3630)*Site!$B$34*0.3048^3/454*Site!$B$31/Site!$B$32*Site!$B$36","v":0},{"$f":"IFERROR(($R32+$S32)*($F32+$G32*$Q32/100)/$H32,0)","v":0},{"$f":"$R32+$S32-$T32","v":0}]
["4.b. Grass Channel C/D Soils (Spec #3)",10,null,null,{"$f":"SUMIF($N$13:$N$92,$P132,$G$13:$G$92)","v":0},{"$f":"(Site!$B$32*($G$6*$C33+$G$7*$D33)*3630+$E33)*$B33/100","v":0},{"$f":"(Site!$B$32*($G$6*$C33+$G$7*$D33)*3630+$E33)*(1-$B33/100)","v":0},{"$f":"+$F33+$G33","v":0},15,{"$f":"SUMIF($N$13:$N$92,$P132,$M$13:$M$92)","v":0},{"$f":"(Site!$B$32*($G$6*$C33+$G$7*$D33)*3630)*Site!$B$33*0.3048^3/454*Site!$B$31/Site!$B$32*Site!$B$36","v":0},{"$f":"IFERROR(($J33+$K33)*($F33+$G33*$I33/100)/$H33,0)","v":0},{"$f":"$J33+$K33-$L33","v":0},null,null,null,20,{"$f":"SUMIF($N$13:$N$92,$P132,$U$13:$U$92)","v":0},{"$f":"(Site!$B$32*($G$6*$C33+$G$7*$D33)*3630)*Site!$B$34*0.3048^3/454*Site!$B$31/Site!$B$32*Site!$B$36","v":0},{"$f":"IFERROR(($R33+$S33)*($F33+$G33*$Q33/100)/$H33,0)","v":0},{"$f":"$R33+$S33-$T33","v":0}]
["4.c. Grass Channel with Compost Amended Soils as per specs (see Spec #4)",{"$f":"IF(Site!$J$11=\"2011 Stds & Specs\",30,20)","v":20},null,null,0,{"$f":"(Site!$B$32*($G$6*$C34+$G$7*$D34)*3630+$E34)*$B34/100","v":0},{"$f":"(Site!$B$32*($G$6*$C34+$G$7*$D34)*3630+$E34)*(1-$B34/100)","v":0},0,15,{"$f":"SUMIF($N$13:$N$92,$P133,$M$13:$M$92)","v":0},{"$f":"(Site!$B$32*($G$6*$C34+$G$7*$D34)*3630)*Site!$B$33*0.3048^3/454*Site!$B$31/Site!$B$32*Site!$B$36","v":0},0,0,null,null,null,20,0,{"$f":"(Site!$B$32*($G$6*$C34+$G$7*$D34)*3630)*Site!$B$34*0.3048^3/454*Site!$B$31/Site!$B$32*Site!$B$36","v":0},0,0]
[null,null,null,null,null,null,null,null,null,null,null,null,null,null,null,null,null,null,null,null,null,null,"`"]
["5. Dry Swale (RR)",null,null,null,null,null,null,null,null,null,null,null,null,null,null,null,"5. Dry Swale (RR)"]
["5.a. Dry Swale #1 (Spec #10)",40,null,null,{"$f":"SUMIF($N$13:$N$92,$P134,$G$13:$G$92)","v":0},{"$f":"(Site!$B$32*($G$6*$C37+$G$7*$D37)*3630+$E37)*$B37/100","v":0},{"$f":"(Site!$B$32*($G$6*$C37+$G$7*$D37)*3630+$E37)*(1-$B37/100)","v":0},{"$f":"+$F37+$G37","v":0},20,{"$f":"SUMIF($N$13:$N$92,$P134,$M$13:$M$92)","v":0},{"$f":"(Site!$B$32*($G$6*$C37+$G$7*$D37)*3630)*Site!$B$33*0.3048^3/454*Site!$B$31/Site!$B$32*Site!$B$36","v":0},{"$f":"IFERROR(($J37+$K37)*($F37+$G37*$I37/100)/$H37,0)","v":0},{"$f":"$J37+$K37-$L37","v":0},null,null,null,25,{"$f":"SUMIF($N$13:$N$92,$P134,$U$13:$U$92)","v":0},{"$f":"(Site!$B$32*($G$6*$C37+$G$7*$D37)*3630)*Site!$B$34*0.3048^3/454*Site!$B$31/Site!$B$32*Site!$B$36","v":0},{"$f":"IFERROR(($R37+$S37)*($F37+$G37*$Q37/100)/$H37,0)","v":0},{"$f":"$R37+$S37-$T37","v":0}]
["5.b. Dry Swale #2 (Spec #10)",60,null,null,{"$f":"SUMIF($N$13:$N$92,$P135,$G$13:$G$92)","v":0},{"$f":"(Site!$B$32*($G$6*$C38+$G$7*$D38)*3630+$E38)*$B38/100","v":0},{"$f":"(Site!$B$32*($G$6*$C38+$G$7*$D38)*3630+$E38)*(1-$B38/100)","v":0},{"$f":"+$F38+$G38","v":0},40,{"$f":"SUMIF($N$13:$N$92,$P135,$M$13:$M$92)","v":0},{"$f":"(Site!$B$32*($G$6*$C38+$G$7*$D38)*3630)*Site!$B$33*0.3048^3/454*Site!$B$31/Site!$B$32*Site!$B$36","v":0},{"$f":"IFERROR(($J38+$K38)*($F38+$G38*$I38/100)/$H38,0)","v":0},{"$f":"$J38+$K38-$L38","v":0},null,null,null,35,{"$f":"SUMIF($N$13:$N$92,$P135,$U$13:$U$92)","v":0},{"$f":"(Site!$B$32*($G$6*$C38+$G$7*$D38)*3630)*Site!$B$34*0.3048^3/454*Site!$B$31/Site!$B$32*Site!$B$36","v":0},0,0]
[]
["6. Bioretention (RR)",null,null,null,null,null,null,null,null,null,null,null,null,null,null,null,"6. Bioretention (RR)"]
["6.a. Bioretention #1 or Micro-Bioretention #1 or Urban Bioretention (Spec #9)",40,null,null,{"$f":"SUMIF($N$13:$N$92,$P136,$G$13:$G$92)","v":0},{"$f":"(Site!$B$32*($G$6*$C41+$G$7*$D41)*3630+$E41)*$B41/100","v":0},{"$f":"(Site!$B$32*($G$6*$C41+$G$7*$D41)*3630+$E41)*(1-$B41/100)","v":0},{"$f":"+$F41+$G41","v":0},25,{"$f":"SUMIF($N$13:$N$92,$P136,$M$13:$M$92)","v":0},{"$f":"(Site!$B$32*($G$6*$C41+$G$7*$D41)*3630)*Site!$B$33*0.3048^3/454*Site!$B$31/Site!$B$32*Site!$B$36","v":0},{"$f":"IFERROR(($J41+$K41)*($F41+$G41*$I41/100)/$H41,0)","v":0},{"$f":"$J41+$K41-$L41","v":0},null,null,null,40,{"$f":"SUMIF($N$13:$N$92,$P136,$U$13:$U$92)","v":0},{"$f":"(Site!$B$32*($G$6*$C41+$G$7*$D41)*3630)*Site!$B$34*0.3048^3/454*Site!$B$31/Site!$B$32*Site!$B$36","v":0},{"$f":"IFERROR(($R41+$S41)*($F41+$G41*$Q41/100)/$H41,0)","v":0},{"$f":"$R41+$S41-$T41","v":0}]
["6.b. Bioretention #2 or Micro-Bioretention #2 (Spec #9)",80,null,null,{"$f":"SUMIF($N$13:$N$92,$P137,$G$13:$G$92)","v":0},{"$f":"(Site!$B$32*($G$6*$C42+$G$7*$D42)*3630+$E42)*$B42/100","v":0},{"$f":"(Site!$B$32*($G$6*$C42+$G$7*$D42)*3630+$E42)*(1-$B42/100)","v":0},{"$f":"+$F42+$G42","v":0},50,{"$f":"SUMIF($N$13:$N$92,$P137,$M$13:$M$92)","v":0},{"$f":"(Site!$B$32*($G$6*$C42+$G$7*$D42)*3630)*Site!$B$33*0.3048^3/454*Site!$B$31/Site!$B$32*Site!$B$36","v":0},{"$f":"IFERROR(($J42+$K42)*($F42+$G42*$I42/100)/$H42,0)","v":0},{"$f":"$J42+$K42-$L42","v":0},null,null,null,60,{"$f":"SUMIF($N$13:$N$92,$P137,$U$13:$U$92)","v":0},{"$f":"(Site!$B$32*($G$6*$C42+$G$7*$D42)*3630)*Site!$B$34*0.3048^3/454*Site!$B$31/Site!$B$32*Site!$B$36","v":0},0,0]
[]
["7. Infiltration (RR)",null,null,null,null,null,null,null,null,null,null,null,null,null,null,null,"7. Infiltration (RR)"]
["7.a. Infiltration #1 (Spec #8)",50,null,null,{"$f":"SUMIF($N$13:$N$92,$P138,$G$13:$G$92)","v":0},{"$f":"(Site!$B$32*($G$6*$C45+$G$7*$D45)*3630+$E45)*$B45/100","v":0},{"$f":"(Site!$B$32*($G$6*$C45+$G$7*$D45)*3630+$E45)*(1-$B45/100)","v":0},{"$f":"+$F45+$G45","v":0},25,{"$f":"SUMIF($N$13:$N$92,$P138,$M$13:$M$92)","v":0},{"$f":"(Site!$B$32*($G$6*$C45+$G$7*$D45)*3630)*Site!$B$33*0.3048^3/454*Site!$B$31/Site!$B$32*Site!$B$36","v":0},{"$f":"IFERROR(($J45+$K45)*($F45+$G45*$I45/100)/$H45,0)","v":0},{"$f":"$J45+$K45-$L45","v":0},null,null,null,15,{"$f":"SUMIF($N$13:$N$92,$P138,$U$13:$U$92)","v":0},{"$f":"(Site!$B$32*($G$6*$C45+$G$7*$D45)*3630)*Site!$B$34*0.3048^3/454*Site!$B$31/Site!$B$32*Site!$B$36","v":0},{"$f":"IFERROR(($R45+$S45)*($F45+$G45*$Q45/100)/$H45,0)","v":0},{"$f":"$R45+$S45-$T45","v":0}]
["7.b. Infiltration #2 (Spec #8)",90,null,null,{"$f":"SUMIF($N$13:$N$92,$P139,$G$13:$G$92)","v":0},{"$f":"(Site!$B$32*($G$6*$C46+$G$7*$D46)*3630+$E46)*$B46/100","v":0},{"$f":"(Site!$B$32*($G$6*$C46+$G$7*$D46)*3630+$E46)*(1-$B46/100)","v":0},{"$f":"+$F46+$G46","v":0},25,{"$f":"SUMIF($N$13:$N$92,$P139,$M$13:$M$92)","v":0},{"$f":"(Site!$B$32*($G$6*$C46+$G$7*$D46)*3630)*Site!$B$33*0.3048^3/454*Site!$B$31/Site!$B$32*Site!$B$36","v":0},{"$f":"IFERROR(($J46+$K46)*($F46+$G46*$I46/100)/$H46,0)","v":0},{"$f":"$J46+$K46-$L46","v":0},null,null,null,15,{"$f":"SUMIF($N$13:$N$92,$P139,$U$13:$U$92)","v":0},{"$f":"(Site!$B$32*($G$6*$C46+$G$7*$D46)*3630)*Site!$B$34*0.3048^3/454*Site!$B$31/Site!$B$32*Site!$B$36","v":0},0,0]
[]
["8. Extended Detention Pond (RR)",null,null,null,null,null,null,null,null,null,null,null,null,null,null,null,"8. Extended Detention Pond (RR)"]
["8.a. ED #1 (Spec #15)",0,null,null,{"$f":"SUMIF($N$13:$N$92,$P140,$G$13:$G$92)","v":0},{"$f":"(Site!$B$32*($G$6*$C49+$G$7*$D49)*3630+$E49)*$B49/100","v":0},{"$f":"(Site!$B$32*($G$6*$C49+$G$7*$D49)*3630+$E49)*(1-$B49/100)","v":0},{"$f":"+$F49+$G49","v":0},15,{"$f":"SUMIF($N$13:$N$92,$P140,$M$13:$M$92)","v":0},{"$f":"(Site!$B$32*($G$6*$C49+$G$7*$D49)*3630)*Site!$B$33*0.3048^3/454*Site!$B$31/Site!$B$32*Site!$B$36","v":0},{"$f":"IFERROR(($J49+$K49)*($F49+$G49*$I49/100)/$H49,0)","v":0},{"$f":"$J49+$K49-$L49","v":0},null,null,null,10,{"$f":"SUMIF($N$13:$N$92,$P140,$U$13:$U$92)","v":0},{"$f":"(Site!$B$32*($G$6*$C49+$G$7*$D49)*3630)*Site!$B$34*0.3048^3/454*Site!$B$31/Site!$B$32*Site!$B$36","v":0},{"$f":"IFERROR(($R49+$S49)*($F49+$G49*$Q49/100)/$H49,0)","v":0},{"$f":"$R49+$S49-$T49","v":0}]
["8.b. ED #2 (Spec #15)",15,null,null,{"$f":"SUMIF($N$13:$N$92,$P141,$G$13:$G$92)","v":0},{"$f":"(Site!$B$32*($G$6*$C50+$G$7*$D50)*3630+$E50)*$B50/100","v":0},{"$f":"(Site!$B$32*($G$6*$C50+$G$7*$D50)*3630+$E50)*(1-$B50/100)","v":0},{"$f":"+$F50+$G50","v":0},15,{"$f":"SUMIF($N$13:$N$92,$P141,$M$13:$M$92)","v":0},{"$f":"(Site!$B$32*($G$6*$C50+$G$7*$D50)*3630)*Site!$B$33*0.3048^3/454*Site!$B$31/Site!$B$32*Site!$B$36","v":0},0,0,null,null,null,10,{"$f":"SUMIF($N$13:$N$92,$P141,$U$13:$U$92)","v":0},{"$f":"(Site!$B$32*($G$6*$C50+$G$7*$D50)*3630)*Site!$B$34*0.3048^3/454*Site!$B$31/Site!$B$32*Site!$B$36","v":0},0,0]
[]
["9. Sheetflow to Filter/Open Space (RR)",null,null,null,null,null,null,null,null,null,null,null,null,null,null,null,"9. Sheetflow to Filter/Open Space (RR)"]
["9.a. Sheetflow to Conservation Area, A/B Soils (Spec #2)",75,null,null,{"$f":"SUMIF($N$13:$N$92,$P142,$G$13:$G$92)","v":0},{"$f":"(Site!$B$32*($G$6*$C53+$G$7*$D53)*3630+$E53)*$B53/100","v":0},{"$f":"(Site!$B$32*($G$6*$C53+$G$7*$D53)*3630+$E53)*(1-$B53/100)","v":0},{"$f":"+$F53+$G53","v":0},0,{"$f":"SUMIF($N$13:$N$92,$P142,$M$13:$M$92)","v":0},{"$f":"(Site!$B$32*($G$6*$C53+$G$7*$D53)*3630)*Site!$B$33*0.3048^3/454*Site!$B$31/Site!$B$32*Site!$B$36","v":0},{"$f":"IFERROR(($J53+$K53)*($F53+$G53*$I53/100)/$H53,0)","v":0},{"$f":"$J53+$K53-$L53","v":0},null,null,null,0,{"$f":"SUMIF($N$13:$N$92,$P142,$U$13:$U$92)","v":0},{"$f":"(Site!$B$32*($G$6*$C53+$G$7*$D53)*3630)*Site!$B$34*0.3048^3/454*Site!$B$31/Site!$B$32*Site!$B$36","v":0},{"$f":"IFERROR(($R53+$S53)*($F53+$G53*$Q53/100)/$H53,0)","v":0},{"$f":"$R53+$S53-$T53","v":0}]
["9.b. Sheetflow to Conservation Area, C/D Soils (Spec #2)",50,null,null,{"$f":"SUMIF($N$13:$N$92,$P143,$G$13:$G$92)","v":0},{"$f":"(Site!$B$32*($G$6*$C54+$G$7*$D54)*3630+$E54)*$B54/100","v":0},{"$f":"(Site!$B$32*($G$6*$C54+$G$7*$D54)*3630+$E54)*(1-$B54/100)","v":0},{"$f":"+$F54+$G54","v":0},0,{"$f":"SUMIF($N$13:$N$92,$P143,$M$13:$M$92)","v":0},{"$f":"(Site!$B$32*($G$6*$C54+$G$7*$D54)*3630)*Site!$B$33*0.3048^3/454*Site!$B$31/Site!$B$32*Site!$B$36","v":0},0,0,null,null,null,0,{"$f":"SUMIF($N$13:$N$92,$P143,$U$13:$U$92)","v":0},{"$f":"(Site!$B$32*($G$6*$C54+$G$7*$D54)*3630)*Site!$B$34*0.3048^3/454*Site!$B$31/Site!$B$32*Site!$B$36","v":0},0,0]
["9.c. Sheetflow to Vegetated Filter Strip, A Soils or Compost Amended B/C/D Soils \n(Spec #2 & #4)",50,null,null,0,{"$f":"(Site!$B$32*($G$6*$C55+$G$7*$D55)*3630+$E55)*$B55/100","v":0},{"$f":"(Site!$B$32*($G$6*$C55+$G$7*$D55)*3630+$E55)*(1-$B55/100)","v":0},0,0,0,{"$f":"(Site!$B$32*($G$6*$C55+$G$7*$D55)*3630)*Site!$B$33*0.3048^3/454*Site!$B$31/Site!$B$32*Site!$B$36","v":0},0,0,null,null,null,0,0,{"$f":"(Site!$B$32*($G$6*$C55+$G$7*$D55)*3630)*Site!$B$34*0.3048^3/454*Site!$B$31/Site!$B$32*Site!$B$36","v":0},0,0]
[]
[]
[null,null,null,null,"TOTAL IMPERVIOUS COVER TREATED (ac)",{"$f":"SUM(D13:D55)","v":0},"AREA CHECK:",{"$f":"IF(F58>$F$7,\"AREA EXCEEDED!\",\"OK.\")","v":"OK."}]
[null,null,null,null,"TOTAL MANAGED TURF AREA TREATED (ac)",{"$f":"SUM(C32:C55)","v":0},"AREA CHECK:",{"$f":"IF(F59>$F$6,\"AREA EXCEEDED!\",\"OK.\")","v":"OK."}]
[null,null,null,null,"TOTAL RUNOFF REDUCTION IN D.A. E (ft3)",{"$f":"IFERROR(SUM($F$13:$F$55),0)","v":0}]
[]
[null,null,null,null,null,null,null,"TOTAL PHOSPHORUS AVAILABLE FOR REMOVAL IN D.A. E (lb/yr)",{"$f":"$M$7","v":0}]
[null,null,null,null,null,null,null,"TOTAL PHOSPHORUS REMOVED WITH RUNOFF REDUCTION PRACTICES IN D.A. E (lb/yr)",{"$f":"IFERROR(SUM(L13:L55),0)","v":0},null,null,null,null,null,null,null,null,null,null,null,"TOTAL RUNOFF REDUCTION IN D.A. E (ft3)",{"$f":"F60","v":0}]
[null,null,null,null,null,null,null,"TOTAL PHOSPHORUS REMAINING AFTER APPLYING RUNOFF REDUCTION PRACTICES IN D.A. E (lb/yr)",{"$f":"I62-I63","v":0},null,null,null,null,null,null,null,null,null,null,null,"NITROGEN REMOVED WITH RUNOFF REDUCTION PRACTICES IN D.A. E (lb/yr)",{"$f":"SUM($T$13:$T$55)","v":0}]
[]
[null,null,"SEE WATER QUALITY COMPLIANCE TAB FOR SITE COMPLIANCE CALCULATIONS",null,null,null,null,null,null,null,null,null,null,null,null,null,null,null,null,null,null,"           SEE WATER QUALITY COMPLIANCE TAB FOR SITE CALCULATIONS (Information Only)"]
[]
[]
[]
[]
["10. Wet Swale (no RR)",null,null,null,null,null,null,null,null,null,null,null,null,null,null,null,null,"10. Wet Swale (Coastal Plain) (no RR)"]
["10.a. Wet Swale #1 (Spec #11)",0,null,null,{"$f":"SUMIF($N$13:$N$92,$P145,$G$13:$G$92)","v":0},{"$f":"(Site!$B$32*($G$6*$C72+$G$7*$D72)*3630+$E72)*$B72/100","v":0},{"$f":"(Site!$B$32*($G$6*$C72+$G$7*$D72)*3630+$E72)*(1-$B72/100)","v":0},{"$f":"+$F72+$G72","v":0},20,{"$f":"SUMIF($N$13:$N$92,$P145,$M$13:$M$92)","v":0},{"$f":"(Site!$B$32*($G$6*$C72+$G$7*$D72)*3630)*Site!$B$33*0.3048^3/454*Site!$B$31/Site!$B$32*Site!$B$36","v":0},{"$f":"IFERROR(($J72+$K72)*($F72+$G72*$I72/100)/$H72,0)","v":0},{"$f":"$J72+$K72-$L72","v":0},null,null,null,25,{"$f":"SUMIF($N$13:$N$92,$P145,$U$13:$U$92)","v":0},{"$f":"(Site!$B$32*($G$6*$C72+$G$7*$D72)*3630)*Site!$B$34*0.3048^3/454*Site!$B$31/Site!$B$32*Site!$B$36","v":0},{"$f":"IFERROR(($R72+$S72)*($F72+$G72*$Q72/100)/$H72,0)","v":0},{"$f":"$R72+$S72-$T72","v":0}]
["10.b. Wet Swale #2 (Spec #11)",0,null,null,{"$f":"SUMIF($N$13:$N$92,$P146,$G$13:$G$92)","v":0},{"$f":"(Site!$B$32*($G$6*$C73+$G$7*$D73)*3630+$E73)*$B73/100","v":0},{"$f":"(Site!$B$32*($G$6*$C73+$G$7*$D73)*3630+$E73)*(1-$B73/100)","v":0},0,40,{"$f":"SUMIF($N$13:$N$92,$P146,$M$13:$M$92)","v":0},{"$f":"(Site!$B$32*($G$6*$C73+$G$7*$D73)*3630)*Site!$B$33*0.3048^3/454*Site!$B$31/Site!$B$32*Site!$B$36","v":0},0,0,null,null,null,35,{"$f":"SUMIF($N$13:$N$92,$P146,$U$13:$U$92)","v":0},{"$f":"(Site!$B$32*($G$6*$C73+$G$7*$D73)*3630)*Site!$B$34*0.3048^3/454*Site!$B$31/Site!$B$32*Site!$B$36","v":0},0,0]
[]
["11.  Filtering Practices (no RR)",null,null,null,null,null,null,null,null,null,null,null,null,null,null,null,"11.  Filtering Practices (no RR)"]
["11.a.Filtering Practice #1 (Spec #12)",0,null,null,{"$f":"SUMIF($N$13:$N$92,$P147,$G$13:$G$92)","v":0},{"$f":"(Site!$B$32*($G$6*$C76+$G$7*$D76)*3630+$E76)*$B76/100","v":0},{"$f":"(Site!$B$32*($G$6*$C76+$G$7*$D76)*3630+$E76)*(1-$B76/100)","v":0},{"$f":"+$F76+$G76","v":0},60,{"$f":"SUMIF($N$13:$N$92,$P147,$M$13:$M$92)","v":0},{"$f":"(Site!$B$32*($G$6*$C76+$G$7*$D76)*3630)*Site!$B$33*0.3048^3/454*Site!$B$31/Site!$B$32*Site!$B$36","v":0},{"$f":"IFERROR(($J76+$K76)*($F76+$G76*$I76/100)/$H76,0)","v":0},{"$f":"$J76+$K76-$L76","v":0},null,null,null,30,{"$f":"SUMIF($N$13:$N$92,$P147,$U$13:$U$92)","v":0},{"$f":"(Site!$B$32*($G$6*$C76+$G$7*$D76)*3630)*Site!$B$34*0.3048^3/454*Site!$B$31/Site!$B$32*Site!$B$36","v":0},{"$f":"IFERROR(($R76+$S76)*($F76+$G76*$Q76/100)/$H76,0)","v":0},{"$f":"$R76+$S76-$T76","v":0}]
["11.b. Filtering Practice #2 (Spec #12)",0,null,null,{"$f":"SUMIF($N$13:$N$92,$P148,$G$13:$G$92)","v":0},{"$f":"(Site!$B$32*($G$6*$C77+$G$7*$D77)*3630+$E77)*$B77/100","v":0},{"$f":"(Site!$B$32*($G$6*$C77+$G$7*$D77)*3630+$E77)*(1-$B77/100)","v":0},0,65,{"$f":"SUMIF($N$13:$N$92,$P148,$M$13:$M$92)","v":0},{"$f":"(Site!$B$32*($G$6*$C77+$G$7*$D77)*3630)*Site!$B$33*0.3048^3/454*Site!$B$31/Site!$B$32*Site!$B$36","v":0},0,0,null,null,null,45,{"$f":"SUMIF($N$13:$N$92,$P148,$U$13:$U$92)","v":0},{"$f":"(Site!$B$32*($G$6*$C77+$G$7*$D77)*3630)*Site!$B$34*0.3048^3/454*Site!$B$31/Site!$B$32*Site!$B$36","v":0},0,0]
[]
["12. Constructed Wetland (no RR)",null,null,null,null,null,null,null,null,null,null,null,null,null,null,null,"12. Constructed Wetland (no RR)"]
["12.a.Constructed Wetland #1 (Spec #13)",0,null,null,{"$f":"SUMIF($N$13:$N$92,$P149,$G$13:$G$92)","v":0},{"$f":"(Site!$B$32*($G$6*$C80+$G$7*$D80)*3630+$E80)*$B80/100","v":0},{"$f":"(Site!$B$32*($G$6*$C80+$G$7*$D80)*3630+$E80)*(1-$B80/100)","v":0},{"$f":"+$F80+$G80","v":0},50,{"$f":"SUMIF($N$13:$N$92,$P149,$M$13:$M$92)","v":0},{"$f":"(Site!$B$32*($G$6*$C80+$G$7*$D80)*3630)*Site!$B$33*0.3048^3/454*Site!$B$31/Site!$B$32*Site!$B$36","v":0},{"$f":"IFERROR(($J80+$K80)*($F80+$G80*$I80/100)/$H80,0)","v":0},{"$f":"$J80+$K80-$L80","v":0},null,null,null,25,{"$f":"SUMIF($N$13:$N$92,$P149,$U$13:$U$92)","v":0},{"$f":"(Site!$B$32*($G$6*$C80+$G$7*$D80)*3630)*Site!$B$34*0.3048^3/454*Site!$B$31/Site!$B$32*Site!$B$36","v":0},{"$f":"IFERROR(($R80+$S80)*($F80+$G80*$Q80/100)/$H80,0)","v":0},{"$f":"$R80+$S80-$T80","v":0}]
["12.b. Constructed Wetland #2 (Spec #13)",0,null,null,{"$f":"SUMIF($N$13:$N$92,$P150,$G$13:$G$92)","v":0},{"$f":"(Site!$B$32*($G$6*$C81+$G$7*$D81)*3630+$E81)*$B81/100","v":0},{"$f":"(Site!$B$32*($G$6*$C81+$G$7*$D81)*3630+$E81)*(1-$B81/100)","v":0},0,75,{"$f":"SUMIF($N$13:$N$92,$P150,$M$13:$M$92)","v":0},{"$f":"(Site!$B$32*($G$6*$C81+$G$7*$D81)*3630)*Site!$B$33*0.3048^3/454*Site!$B$31/Site!$B$32*Site!$B$36","v":0},0,0,null,null,null,55,{"$f":"SUMIF($N$13:$N$92,$P150,$U$13:$U$92)","v":0},{"$f":"(Site!$B$32*($G$6*$C81+$G$7*$D81)*3630)*Site!$B$34*0.3048^3/454*Site!$B$31/Site!$B$32*Site!$B$36","v":0},0,0]
[]
["13. Wet Ponds (no RR)",null,null,null,null,null,null,null,null,null,null,null,null,null,null,null,"13. Wet Ponds (no RR)"]
["13.a. Wet Pond #1 (Spec #14)",0,null,null,{"$f":"SUMIF($N$13:$N$92,$P151,$G$13:$G$92)","v":0},{"$f":"(Site!$B$32*($G$6*$C84+$G$7*$D84)*3630+$E84)*$B84/100","v":0},{"$f":"(Site!$B$32*($G$6*$C84+$G$7*$D84)*3630+$E84)*(1-$B84/100)","v":0},{"$f":"+$F84+$G84","v":0},50,{"$f":"SUMIF($N$13:$N$92,$P151,$M$13:$M$92)","v":0},{"$f":"(Site!$B$32*($G$6*$C84+$G$7*$D84)*3630)*Site!$B$33*0.3048^3/454*Site!$B$31/Site!$B$32*Site!$B$36","v":0},{"$f":"IFERROR(($J84+$K84)*($F84+$G84*$I84/100)/$H84,0)","v":0},{"$f":"$J84+$K84-$L84","v":0},null,null,null,30,{"$f":"SUMIF($N$13:$N$92,$P151,$U$13:$U$92)","v":0},{"$f":"(Site!$B$32*($G$6*$C84+$G$7*$D84)*3630)*Site!$B$34*0.3048^3/454*Site!$B$31/Site!$B$32*Site!$B$36","v":0},{"$f":"IFERROR(($R84+$S84)*($F84+$G84*$Q84/100)/$H84,0)","v":0},{"$f":"$R84+$S84-$T84","v":0}]
["13.b. Wet Pond #1 (Coastal Plain) (Spec #14)",0,null,null,{"$f":"SUMIF($N$13:$N$92,$P152,$G$13:$G$92)","v":0},{"$f":"(Site!$B$32*($G$6*$C85+$G$7*$D85)*3630+$E85)*$B85/100","v":0},{"$f":"(Site!$B$32*($G$6*$C85+$G$7*$D85)*3630+$E85)*(1-$B85/100)","v":0},0,45,{"$f":"SUMIF($N$13:$N$92,$P152,$M$13:$M$92)","v":0},{"$f":"(Site!$B$32*($G$6*$C85+$G$7*$D85)*3630)*Site!$B$33*0.3048^3/454*Site!$B$31/Site!$B$32*Site!$B$36","v":0},0,0,null,null,null,20,{"$f":"SUMIF($N$13:$N$92,$P152,$U$13:$U$92)","v":0},{"$f":"(Site!$B$32*($G$6*$C85+$G$7*$D85)*3630)*Site!$B$34*0.3048^3/454*Site!$B$31/Site!$B$32*Site!$B$36","v":0},0,0]
["13.c. Wet Pond #2 (Spec #14)",0,null,null,0,{"$f":"(Site!$B$32*($G$6*$C86+$G$7*$D86)*3630+$E86)*$B86/100","v":0},{"$f":"(Site!$B$32*($G$6*$C86+$G$7*$D86)*3630+$E86)*(1-$B86/100)","v":0},0,75,0,{"$f":"(Site!$B$32*($G$6*$C86+$G$7*$D86)*3630)*Site!$B$33*0.3048^3/454*Site!$B$31/Site!$B$32*Site!$B$36","v":0},0,0,null,null,null,40,0,{"$f":"(Site!$B$32*($G$6*$C86+$G$7*$D86)*3630)*Site!$B$34*0.3048^3/454*Site!$B$31/Site!$B$32*Site!$B$36","v":0},0,0]
["13.d. Wet Pond #2 (Coastal Plain) (Spec #14)",0,null,null,0,{"$f":"(Site!$B$32*($G$6*$C87+$G$7*$D87)*3630+$E87)*$B87/100","v":0},{"$f":"(Site!$B$32*($G$6*$C87+$G$7*$D87)*3630+$E87)*(1-$B87/100)","v":0},0,65,0,{"$f":"(Site!$B$32*($G$6*$C87+$G$7*$D87)*3630)*Site!$B$33*0.3048^3/454*Site!$B$31/Site!$B$32*Site!$B$36","v":0},0,0,null,null,null,30,0,{"$f":"(Site!$B$32*($G$6*$C87+$G$7*$D87)*3630)*Site!$B$34*0.3048^3/454*Site!$B$31/Site!$B$32*Site!$B$36","v":0},0,0]
[]
["14. Manufactured Treatment Devices (no RR)",null,null,null,null,null,null,null,null,null,null,null,null,null,null,null,null,"14. Manufactured BMP (no RR)"]
["14.a. Manufactured Treatment Device-Hydrodynamic",0,null,null,{"$f":"SUMIF($N$13:$N$92,$P155,$G$13:$G$92)","v":0},{"$f":"(Site!$B$32*($G$6*$C90+$G$7*$D90)*3630+$E90)*$B90/100","v":0},{"$f":"(Site!$B$32*($G$6*$C90+$G$7*$D90)*3630+$E90)*(1-$B90/100)","v":0},{"$f":"+$F90+$G90","v":0},20,{"$f":"SUMIF($N$13:$N$92,$P155,$M$13:$M$92)","v":0},{"$f":"(Site!$B$32*($G$6*$C90+$G$7*$D90)*3630)*Site!$B$33*0.3048^3/454*Site!$B$31/Site!$B$32*Site!$B$36","v":0},{"$f":"IFERROR(($J90+$K90)*($F90+$G90*$I90/100)/$H90,0)","v":0},{"$f":"$J90+$K90-$L90","v":0},null,null,null,0,{"$f":"SUMIF($N$13:$N$92,$P155,$U$13:$U$92)","v":0},{"$f":"(Site!$B$32*($G$6*$C90+$G$7*$D90)*3630)*Site!$B$34*0.3048^3/454*Site!$B$31/Site!$B$32*Site!$B$36","v":0},{"$f":"IFERROR(($R90+$S90)*($F90+$G90*$Q90/100)/$H90,0)","v":0},{"$f":"$R90+$S90-$T90","v":0}]
["14.b. Manufactured Treatment Device-Filtering",0,null,null,{"$f":"SUMIF($N$13:$N$92,$P156,$G$13:$G$92)","v":0},{"$f":"(Site!$B$32*($G$6*$C91+$G$7*$D91)*3630+$E91)*$B91/100","v":0},{"$f":"(Site!$B$32*($G$6*$C91+$G$7*$D91)*3630+$E91)*(1-$B91/100)","v":0},0,20,{"$f":"SUMIF($N$13:$N$92,$P156,$M$13:$M$92)","v":0},{"$f":"(Site!$B$32*($G$6*$C91+$G$7*$D91)*3630)*Site!$B$33*0.3048^3/454*Site!$B$31/Site!$B$32*Site!$B$36","v":0},0,0,null,null,null,0,{"$f":"SUMIF($N$13:$N$92,$P156,$U$13:$U$92)","v":0},{"$f":"(Site!$B$32*($G$6*$C91+$G$7*$D91)*3630)*Site!$B$34*0.3048^3/454*Site!$B$31/Site!$B$32*Site!$B$36","v":0},0,0]
["14.c. Manufactured Treatment Device-Generic",0,null,null,0,{"$f":"(Site!$B$32*($G$6*$C92+$G$7*$D92)*3630+$E92)*$B92/100","v":0},{"$f":"(Site!$B$32*($G$6*$C92+$G$7*$D92)*3630+$E92)*(1-$B92/100)","v":0},0,20,0,{"$f":"(Site!$B$32*($G$6*$C92+$G$7*$D92)*3630)*Site!$B$33*0.3048^3/454*Site!$B$31/Site!$B$32*Site!$B$36","v":0},0,0,null,null,null,0,0,{"$f":"(Site!$B$32*($G$6*$C92+$G$7*$D92)*3630)*Site!$B$34*0.3048^3/454*Site!$B$31/Site!$B$32*Site!$B$36","v":0},0,0]
[]
[]
[]
[null,null,null,null,"TOTAL IMPERVIOUS COVER TREATED (ac)",{"$f":"SUM($D$13:$D$92)","v":0},"AREA CHECK:",{"$f":"IF($F$96>$F$7,\"AREA EXCEEDED!\",\"OK.\")","v":"OK."}]
[null,null,null,null,"TOTAL MANAGED TURF AREA TREATED (ac)",{"$f":"SUM($C$13:$C$92)","v":0},"AREA CHECK:",{"$f":"IF($F$97>$F$6,\"AREA EXCEEDED!\",\"OK.\")","v":"OK."}]
[]
[null,null,null,null,null,null,null,"TOTAL PHOSPHORUS REMOVAL REQUIRED ON SITE (lb/yr)",{"$f":"IF(Site!G63=\"Check Areas!\",\"ERROR - \",Site!G63)","v":"--"},{"$f":"IF(I99=\"ERROR - \",\"Site Data Tab\",\"\")","v":""}]
[]
[null,null,null,null,null,null,null,"TOTAL PHOSPHORUS AVAILABLE FOR REMOVAL IN D.A. E (lb/yr)",{"$f":"$M$7","v":0}]
[null,null,null,null,null,null,null,"TOTAL PHOSPHORUS REMOVED WITHOUT RUNOFF REDUCTION PRACTICES IN D.A. E (lb/yr)",{"$f":"SUM($L$72:$L$92)","v":0}]
[null,null,null,null,null,null,null,"TOTAL PHOSPHORUS REMOVED WITH RUNOFF REDUCTION PRACTICES IN D.A. E (lb/yr)",{"$f":"$I$63","v":0}]
[null,null,null,null,null,null,null,"TOTAL PHOSPHORUS LOAD REDUCTION ACHIEVED IN D.A. E (lb/yr)",{"$f":"$I$102+$I$103","v":0}]
[null,null,null,null,null,null,null,"TOTAL PHOSPHORUS REMAINING AFTER APPLYING BMP LOAD REDUCTIONS IN D.A. E (lb/yr)",{"$f":"$I$101-$I$104","v":0}]
[]
[null,null,"SEE WATER QUALITY COMPLIANCE TAB FOR SITE COMPLIANCE CALCULATIONS"]
[]
[null,null,null,null,null,null,null,"NITROGEN REMOVED WITH RUNOFF REDUCTION PRACTICES IN D.A. E (lb/yr)",{"$f":"IFERROR(SUM($T$13:$T$55),0)","v":0}]
[null,null,null,null,null,null,null,"NITROGEN REMOVED WITHOUT RUNOFF REDUCTION PRACTICES IN D.A. E (lb/yr)",{"$f":"SUM($T$72:$T$92)","v":0}]
[null,null,null,null,null,null,null,"TOTAL NITROGEN REMOVED IN D.A. E (lb/yr)",{"$f":"$I$109+$I$110","v":0}]
[]
[]
[]
[]
[null,null,"Downstream Practices - Dropdown selections for each applicable BMP"]
[]
["Options for 1. Green Roof",null,"Options for 2. Impervious Surface Disconnection",null,"Options for 3a. Pervious Parking, A/B Soils",null,"Options for 4a. Grass Channels, A/B Soils",null,null,"Options for 4b. Grass Channels, C/D Soils"]
[null,null,null,null,null,null,null,null,null,null,null,"Options for 4.c. Grass Channel Compost Amended Soils",null,null,null,"Master Downstream BMP Reference List"]
[{"$f":"P120","v":"None"},null,{"$f":"P120","v":"None"},null,{"$f":"P120","v":"None"},null,{"$f":"P120","v":"None"},null,null,{"$f":"P120","v":"None"},null,null,null,null,null,"None"]
["2.a. Simple Disconnection to A/B Soils",null,{"$f":"P131","v":"4.a. Grass Channel A/B Soils"},null,{"$f":"P131","v":"4.a. Grass Channel A/B Soils"},null,{"$f":"P132","v":"4.b. Grass Channel C/D Soils"},null,null,{"$f":"P131","v":"4.a. Grass Channel A/B Soils"},null,{"$f":"P120","v":"None"},null,null,null,"2.a. Simple Disconnection to A/B Soils"]
["2.b. Simple Disconnection to C/D Soils",null,"4.b. Grass Channel C/D Soils",null,"4.b. Grass Channel C/D Soils",null,"4.c. Grass Channel Compost Amended Soils",null,null,{"$f":"P133","v":"4.c. Grass Channel Compost Amended Soils"},null,{"$f":"P131","v":"4.a. Grass Channel A/B Soils"},null,null,null,"2.b. Simple Disconnection to C/D Soils"]
["2.c. To Soil Amended Filter Path",null,"4.c. Grass Channel Compost Amended Soils",null,"4.c. Grass Channel Compost Amended Soils",null,"5.a. Dry Swale #1",null,null,"5.a. Dry Swale #1",null,{"$f":"P132","v":"4.b. Grass Channel C/D Soils"},null,null,null,"2.c. To Soil Amended Filter Path"]
["2.d. To Dry Well/French Drain #1 (Micro-Infiltration #1)",null,"5.a. Dry Swale #1",null,"5.a. Dry Swale #1",null,"5.b. Dry Swale #2",null,null,"5.b. Dry Swale #2",null,{"$f":"P134","v":"5.a. Dry Swale #1"},null,null,null,"2.d. To Dry Well/French Drain #1 (Micro-Infiltration #1)"]
["2.e. To Dry Well/French Drain #2 (Micro-Infiltration. #2)",null,"5.b. Dry Swale #2",null,"5.b. Dry Swale #2",null,"6.a. Bioretention #1",null,null,"6.a. Bioretention #1",null,"5.b. Dry Swale #2",null,null,null,"2.e. To Dry Well/French Drain #2 (Micro-Infiltration. #2)"]
["2.f. To Rain Garden #1 (Micro-Bioretention #1)",null,"6.a. Bioretention #1",null,"6.a. Bioretention #1",null,"6.b. Bioretention #2",null,null,"6.b. Bioretention #2",null,"6.a. Bioretention #1",null,null,null,"2.f. To Rain Garden #1 (Micro-Bioretention #1)"]
["2.g. To Rain Garden #2 (Micro-Bioretention #2)",null,"6.b. Bioretention #2",null,"6.b. Bioretention #2",null,"7.a. Infiltration #1",null,null,"7.a. Infiltration #1",null,"6.b. Bioretention #2",null,null,null,"2.g. To Rain Garden #2 (Micro-Bioretention #2)"]
["2.h. To Train Barrel, Rain Tank, or Cistern",null,"7.a. Infiltration #1",null,"7.a. Infiltration #1",null,"7.b. Infiltration #2",null,null,"7.b. Infiltration #2",null,"7.a. Infiltration #1",null,null,null,"2.h. To Train Barrel, Rain Tank, or Cistern"]
["2.i. To Stormwater Planter (Urban Bioretention)",null,"7.b. Infiltration #2",null,"7.b. Infiltration #2",null,"8.a. ED #1",null,null,"8.a. ED #1",null,"7.b. Infiltration #2",null,null,null,"2.i. To Stormwater Planter (Urban Bioretention)"]
["3.a. Permeable Pavement #1",null,"8.a. ED #1",null,"8.a. ED #1",null,"8.b. ED #2",null,null,"8.b. ED #2",null,"8.a. ED #1",null,null,null,"3.a. Permeable Pavement #1"]
["4.a. Grass Channel A/B Soils",null,"8.b. ED #2",null,"8.b. ED #2",null,"9.a. Sheetflow to A/B Soil Conservation Area ",null,null,"9.a. Sheetflow to A/B Soil Conservation Area ",null,"8.b. ED #2",null,null,null,"4.a. Grass Channel A/B Soils"]
["4.b. Grass Channel C/D Soils",null,"9.a. Sheetflow to A/B Soil Conservation Area ",null,"9.a. Sheetflow to A/B Soil Conservation Area ",null,"9.b. Sheetflow to C/D Soil Conservation Area",null,null,"9.b. Sheetflow to C/D Soil Conservation Area",null,"9.a. Sheetflow to A/B Soil Conservation Area ",null,null,null,"4.b. Grass Channel C/D Soils"]
["4.c. Grass Channel Compost Amended Soils",null,"9.b. Sheetflow to C/D Soil Conservation Area",null,"9.b. Sheetflow to C/D Soil Conservation Area",null,"9.c. Sheetflow to Vegetated Filter Strip",null,null,"9.c. Sheetflow to Vegetated Filter Strip",null,"9.b. Sheetflow to C/D Soil Conservation Area",null,null,null,"4.c. Grass Channel Compost Amended Soils"]
["5.a. Dry Swale #1",null,"9.c. Sheetflow to Vegetated Filter Strip",null,"9.c. Sheetflow to Vegetated Filter Strip",null,"10.a. Wet Swale #1",null,null,"10.a. Wet Swale #1",null,"9.c. Sheetflow to Vegetated Filter Strip",null,null,null,"5.a. Dry Swale #1"]
["5.b. Dry Swale #2",null,"10.a. Wet Swale #1",null,"10.a. Wet Swale #1",null,"10.b. Wet Swale #2",null,null,"10.b. Wet Swale #2",null,"10.a. Wet Swale #1",null,null,null,"5.b. Dry Swale #2"]
["6.a. Bioretention #1",null,"10.b. Wet Swale #2",null,"10.b. Wet Swale #2",null,"11.a. Filtering Practice #1",null,null,"11.a. Filtering Practice #1",null,"10.b. Wet Swale #2",null,null,null,"6.a. Bioretention #1"]
["6.b. Bioretention #2",null,"11.a. Filtering Practice #1",null,"11.a. Filtering Practice #1",null,"11.b. Filtering Practice #2",null,null,"11.b. Filtering Practice #2",null,"11.a. Filtering Practice #1",null,null,null,"6.b. Bioretention #2"]
["7.a. Infiltration #1",null,"11.b. Filtering Practice #2",null,"11.b. Filtering Practice #2",null,"12.a. Constructed Wetland #1",null,null,"12.a. Constructed Wetland #1",null,"11.b. Filtering Practice #2",null,null,null,"7.a. Infiltration #1"]
["7.b. Infiltration #2",null,"12.a. Constructed Wetland #1",null,"12.a. Constructed Wetland #1",null,"12.b. Constructed Wetland #2",null,null,"12.b. Constructed Wetland #2",null,"12.a. Constructed Wetland #1",null,null,null,"7.b. Infiltration #2"]
["8.a. ED #1",null,"12.b. Constructed Wetland #2",null,"12.b. Constructed Wetland #2",null,"13.a. Wet Pond #1",null,null,"13.a. Wet Pond #1",null,"12.b. Constructed Wetland #2",null,null,null,"8.a. ED #1"]
["8.b. ED #2",null,"13.a. Wet Pond #1",null,"13.a. Wet Pond #1",null,"13.b. Wet Pond #1 (Coastal Plain)",null,null,"13.b. Wet Pond #1 (Coastal Plain)",null,"13.a. Wet Pond #1",null,null,null,"8.b. ED #2"]
["9.a. Sheetflow to A/B Soil Conservation Area ",null,"13.b. Wet Pond #1 (Coastal Plain)",null,"13.b. Wet Pond #1 (Coastal Plain)",null,"13.c. Wet Pond #2",null,null,"13.c. Wet Pond #2",null,"13.b. Wet Pond #1 (Coastal Plain)",null,null,null,"9.a. Sheetflow to A/B Soil Conservation Area "]
["9.b. Sheetflow to C/D Soil Conservation Area",null,"13.c. Wet Pond #2",null,"13.c. Wet Pond #2",null,"13.d. Wet Pond #2 (Coastal Plain)",null,null,"13.d. Wet Pond #2 (Coastal Plain)",null,"13.c. Wet Pond #2",null,null,null,"9.b. Sheetflow to C/D Soil Conservation Area"]
["9.c. Sheetflow to Vegetated Filter Strip",null,"13.d. Wet Pond #2 (Coastal Plain)",null,"13.d. Wet Pond #2 (Coastal Plain)",null,"14.a. MTD - Hydrodynamic",null,null,"14.a. MTD - Hydrodynamic",null,"13.d. Wet Pond #2 (Coastal Plain)",null,null,null,"9.c. Sheetflow to Vegetated Filter Strip"]
["10.a. Wet Swale #1",null,"14.a. MTD - Hydrodynamic",null,"14.a. MTD - Hydrodynamic",null,"14.b. MTD - Filtering",null,null,"14.b. MTD - Filtering",null,"14.a. MTD - Hydrodynamic",null,null,null,"10.a. Wet Swale #1"]
["10.b. Wet Swale #2",null,"14.b. MTD - Filtering",null,"14.b. MTD - Filtering",null,"14.c. MTD - Generic",null,null,"14.c. MTD - Generic",null,"14.b. MTD - Filtering",null,null,null,"10.b. Wet Swale #2"]
["11.a. Filtering Practice #1",null,"14.c. MTD - Generic",null,"14.c. MTD - Generic",null,null,null,null,null,null,"14.c. MTD - Generic",null,null,null,"11.a. Filtering Practice #1"]
["11.b. Filtering Practice #2",null,null,null,null,null,null,null,null,null,null,null,null,null,null,"11.b. Filtering Practice #2"]
["12.a. Constructed Wetland #1",null,null,null,null,null,null,null,null,null,null,null,null,null,null,"12.a. Constructed Wetland #1"]
["12.b. Constructed Wetland #2",null,null,null,null,null,null,null,null,null,null,null,null,null,null,"12.b. Constructed Wetland #2"]
["13.a. Wet Pond #1",null,null,null,null,null,null,null,null,null,null,null,null,null,null,"13.a. Wet Pond #1"]
["13.b. Wet Pond #1 (Coastal Plain)",null,null,null,null,null,null,null,null,null,null,null,null,null,null,"13.b. Wet Pond #1 (Coastal Plain)"]
["13.c. Wet Pond #2",null,null,null,null,null,null,null,null,null,null,null,null,null,null,"13.c. Wet Pond #2"]
["13.d. Wet Pond #2 (Coastal Plain)",null,null,null,null,null,null,null,null,null,null,null,null,null,null,"13.d. Wet Pond #2 (Coastal Plain)"]
["14.a. MTD - Hydrodynamic",null,null,null,null,null,null,null,null,null,null,null,null,null,null,"14.a. MTD - Hydrodynamic"]
["14.b. MTD - Filtering",null,null,null,null,null,null,null,null,null,null,null,null,null,null,"14.b. MTD - Filtering"]
["14.c. MTD - Generic",null,null,null,null,null,null,null,null,null,null,null,null,null,null,"14.c. MTD - Generic"]
[]
["Options for 5a. Dry Swale #1",null,"Options for 5b. Dry Swale #2",null,"Options for 6a. Bioretention #1",null,"Options for 6b. Bioretention #2",null,null,"Options for 7a. Infiltration #1",null,"Options for 7b. Infiltration #2"]
[]
[{"$f":"P120","v":"None"},null,{"$f":"P120","v":"None"},null,{"$f":"P120","v":"None"},null,{"$f":"P120","v":"None"},null,null,{"$f":"P120","v":"None"},null,{"$f":"P120","v":"None"}]
[{"$f":"P131","v":"4.a. Grass Channel A/B Soils"},null,{"$f":"P131","v":"4.a. Grass Channel A/B Soils"},null,{"$f":"P131","v":"4.a. Grass Channel A/B Soils"},null,{"$f":"P131","v":"4.a. Grass Channel A/B Soils"},null,null,{"$f":"P131","v":"4.a. Grass Channel A/B Soils"},null,{"$f":"P131","v":"4.a. Grass Channel A/B Soils"}]
[{"$f":"P132","v":"4.b. Grass Channel C/D Soils"},null,{"$f":"P132","v":"4.b. Grass Channel C/D Soils"},null,{"$f":"P132","v":"4.b. Grass Channel C/D Soils"},null,"4.b. Grass Channel C/D Soils",null,null,"4.b. Grass Channel C/D Soils",null,"4.b. Grass Channel C/D Soils"]
[{"$f":"P133","v":"4.c. Grass Channel Compost Amended Soils"},null,{"$f":"P133","v":"4.c. Grass Channel Compost Amended Soils"},null,{"$f":"P133","v":"4.c. Grass Channel Compost Amended Soils"},null,"4.c. Grass Channel Compost Amended Soils",null,null,"4.c. Grass Channel Compost Amended Soils",null,"4.c. Grass Channel Compost Amended Soils"]
[{"$f":"P135","v":"5.b. Dry Swale #2"},null,{"$f":"P134","v":"5.a. Dry Swale #1"},null,{"$f":"P134","v":"5.a. Dry Swale #1"},null,"5.a. Dry Swale #1",null,null,"5.a. Dry Swale #1",null,"5.a. Dry Swale #1"]
["6.a. Bioretention #1",null,{"$f":"P136","v":"6.a. Bioretention #1"},null,{"$f":"P135","v":"5.b. Dry Swale #2"},null,"5.b. Dry Swale #2",null,null,"5.b. Dry Swale #2",null,"5.b. Dry Swale #2"]
["6.b. Bioretention #2",null,"6.b. Bioretention #2",null,{"$f":"P137","v":"6.b. Bioretention #2"},null,"6.a. Bioretention #1",null,null,"6.a. Bioretention #1",null,"6.a. Bioretention #1"]
["7.a. Infiltration #1",null,"7.a. Infiltration #1",null,"7.a. Infiltration #1",null,{"$f":"P138","v":"7.a. Infiltration #1"},null,null,"6.b. Bioretention #2",null,"6.b. Bioretention #2"]
["7.b. Infiltration #2",null,"7.b. Infiltration #2",null,"7.b. Infiltration #2",null,"7.b. Infiltration #2",null,null,{"$f":"P139","v":"7.b. Infiltration #2"},null,"7.a. Infiltration #1"]
["8.a. ED #1",null,"8.a. ED #1",null,"8.a. ED #1",null,"8.a. ED #1",null,null,"8.a. ED #1",null,{"$f":"P140","v":"8.a. ED #1"}]
["8.b. ED #2",null,"8.b. ED #2",null,"8.b. ED #2",null,"8.b. ED #2",null,null,"8.b. ED #2",null,"8.b. ED #2"]
["9.a. Sheetflow to A/B Soil Conservation Area ",null,"9.a. Sheetflow to A/B Soil Conservation Area ",null,"9.a. Sheetflow to A/B Soil Conservation Area ",null,"9.a. Sheetflow to A/B Soil Conservation Area ",null,null,"9.a. Sheetflow to A/B Soil Conservation Area ",null,"9.a. Sheetflow to A/B Soil Conservation Area "]
["9.b. Sheetflow to C/D Soil Conservation Area",null,"9.b. Sheetflow to C/D Soil Conservation Area",null,"9.b. Sheetflow to C/D Soil Conservation Area",null,"9.b. Sheetflow to C/D Soil Conservation Area",null,null,"9.b. Sheetflow to C/D Soil Conservation Area",null,"9.b. Sheetflow to C/D Soil Conservation Area"]
["9.c. Sheetflow to Vegetated Filter Strip",null,"9.c. Sheetflow to Vegetated Filter Strip",null,"9.c. Sheetflow to Vegetated Filter Strip",null,"9.c. Sheetflow to Vegetated Filter Strip",null,null,"9.c. Sheetflow to Vegetated Filter Strip",null,"9.c. Sheetflow to Vegetated Filter Strip"]
["10.a. Wet Swale #1",null,"10.a. Wet Swale #1",null,"10.a. Wet Swale #1",null,"10.a. Wet Swale #1",null,null,"10.a. Wet Swale #1",null,"10.a. Wet Swale #1"]
["10.b. Wet Swale #2",null,"10.b. Wet Swale #2",null,"10.b. Wet Swale #2",null,"10.b. Wet Swale #2",null,null,"10.b. Wet Swale #2",null,"10.b. Wet Swale #2"]
["11.a. Filtering Practice #1",null,"11.a. Filtering Practice #1",null,"11.a. Filtering Practice #1",null,"11.a. Filtering Practice #1",null,null,"11.a. Filtering Practice #1",null,"11.a. Filtering Practice #1"]
["11.b. Filtering Practice #2",null,"11.b. Filtering Practice #2",null,"11.b. Filtering Practice #2",null,"11.b. Filtering Practice #2",null,null,"11.b. Filtering Practice #2",null,"11.b. Filtering Practice #2"]
["12.a. Constructed Wetland #1",null,"12.a. Constructed Wetland #1",null,"12.a. Constructed Wetland #1",null,"12.a. Constructed Wetland #1",null,null,"12.a. Constructed Wetland #1",null,"12.a. Constructed Wetland #1"]
["12.b. Constructed Wetland #2",null,"12.b. Constructed Wetland #2",null,"12.b. Constructed Wetland #2",null,"12.b. Constructed Wetland #2",null,null,"12.b. Constructed Wetland #2",null,"12.b. Constructed Wetland #2"]
["13.a. Wet Pond #1",null,"13.a. Wet Pond #1",null,"13.a. Wet Pond #1",null,"13.a. Wet Pond #1",null,null,"13.a. Wet Pond #1",null,"13.a. Wet Pond #1"]
["13.b. Wet Pond #1 (Coastal Plain)",null,"13.b. Wet Pond #1 (Coastal Plain)",null,"13.b. Wet Pond #1 (Coastal Plain)",null,"13.b. Wet Pond #1 (Coastal Plain)",null,null,"13.b. Wet Pond #1 (Coastal Plain)",null,"13.b. Wet Pond #1 (Coastal Plain)"]
["13.c. Wet Pond #2",null,"13.c. Wet Pond #2",null,"13.c. Wet Pond #2",null,"13.c. Wet Pond #2",null,null,"13.c. Wet Pond #2",null,"13.c. Wet Pond #2"]
["13.d. Wet Pond #2 (Coastal Plain)",null,"13.d. Wet Pond #2 (Coastal Plain)",null,"13.d. Wet Pond #2 (Coastal Plain)",null,"13.d. Wet Pond #2 (Coastal Plain)",null,null,"13.d. Wet Pond #2 (Coastal Plain)",null,"13.d. Wet Pond #2 (Coastal Plain)"]
["14.a. MTD - Hydrodynamic",null,"14.a. MTD - Hydrodynamic",null,"14.a. MTD - Hydrodynamic",null,"14.a. MTD - Hydrodynamic",null,null,"14.a. MTD - Hydrodynamic",null,"14.a. MTD - Hydrodynamic"]
["14.b. MTD - Filtering",null,"14.b. MTD - Filtering",null,"14.b. MTD - Filtering",null,"14.b. MTD - Filtering",null,null,"14.b. MTD - Filtering",null,"14.b. MTD - Filtering"]
["14.c. MTD - Generic",null,"14.c. MTD - Generic",null,"14.c. MTD - Generic",null,"14.c. MTD - Generic",null,null,"14.c. MTD - Generic",null,"14.c. MTD - Generic"]
[]
["Options for 8a. Extended Detention #1",null,"Options for 8b. Extended Detention #2",null,"Options for 9 Sheet Flow to Open Space",null,"Options for 9c. Sheet Flow to Filter Strip",null,null,"Options for 10a. Wet Swale #1",null,"Options for 10b. Wet Swale #2"]
[]
[{"$f":"P120","v":"None"},null,{"$f":"P120","v":"None"},null,{"$f":"P120","v":"None"},null,{"$f":"P120","v":"None"},null,null,{"$f":"P120","v":"None"},null,{"$f":"P120","v":"None"}]
[{"$f":"P131","v":"4.a. Grass Channel A/B Soils"},null,{"$f":"P131","v":"4.a. Grass Channel A/B Soils"},null,null,null,{"$f":"P131","v":"4.a. Grass Channel A/B Soils"},null,null,{"$f":"P131","v":"4.a. Grass Channel A/B Soils"},null,{"$f":"P131","v":"4.a. Grass Channel A/B Soils"}]
["4.b. Grass Channel C/D Soils",null,"4.b. Grass Channel C/D Soils",null,null,null,"4.b. Grass Channel C/D Soils",null,null,"4.b. Grass Channel C/D Soils",null,"4.b. Grass Channel C/D Soils"]
["4.c. Grass Channel Compost Amended Soils",null,"4.c. Grass Channel Compost Amended Soils",null,null,null,"4.c. Grass Channel Compost Amended Soils",null,null,"4.c. Grass Channel Compost Amended Soils",null,"4.c. Grass Channel Compost Amended Soils"]
["5.a. Dry Swale #1",null,"5.a. Dry Swale #1",null,null,null,"5.a. Dry Swale #1",null,null,"5.a. Dry Swale #1",null,"5.a. Dry Swale #1"]
["5.b. Dry Swale #2",null,"5.b. Dry Swale #2",null,null,null,"5.b. Dry Swale #2",null,null,"5.b. Dry Swale #2",null,"5.b. Dry Swale #2"]
["6.a. Bioretention #1",null,"6.a. Bioretention #1",null,null,null,"6.a. Bioretention #1",null,null,"6.a. Bioretention #1",null,"6.a. Bioretention #1"]
["6.b. Bioretention #2",null,"6.b. Bioretention #2",null,null,null,"6.b. Bioretention #2",null,null,"6.b. Bioretention #2",null,"6.b. Bioretention #2"]
["7.a. Infiltration #1",null,"7.a. Infiltration #1",null,null,null,"7.a. Infiltration #1",null,null,"7.a. Infiltration #1",null,"7.a. Infiltration #1"]
["7.b. Infiltration #2",null,"7.b. Infiltration #2",null,null,null,"7.b. Infiltration #2",null,null,"7.b. Infiltration #2",null,"7.b. Infiltration #2"]
[{"$f":"P141","v":"8.b. ED #2"},null,"8.a. ED #1",null,null,null,"8.a. ED #1",null,null,"8.a. ED #1",null,"8.a. ED #1"]
["9.a. Sheetflow to A/B Soil Conservation Area ",null,{"$f":"P142","v":"9.a. Sheetflow to A/B Soil Conservation Area "},null,null,null,"8.b. ED #2",null,null,"8.b. ED #2",null,"8.b. ED #2"]
["9.b. Sheetflow to C/D Soil Conservation Area",null,"9.b. Sheetflow to C/D Soil Conservation Area",null,null,null,"9.a. Sheetflow to A/B Soil Conservation Area ",null,null,"9.a. Sheetflow to A/B Soil Conservation Area ",null,"9.a. Sheetflow to A/B Soil Conservation Area "]
["9.c. Sheetflow to Vegetated Filter Strip",null,"9.c. Sheetflow to Vegetated Filter Strip",null,null,null,"9.b. Sheetflow to C/D Soil Conservation Area",null,null,"9.b. Sheetflow to C/D Soil Conservation Area",null,"9.b. Sheetflow to C/D Soil Conservation Area"]
["10.a. Wet Swale #1",null,"10.a. Wet Swale #1",null,null,null,{"$f":"P145","v":"10.a. Wet Swale #1"},null,null,"9.c. Sheetflow to Vegetated Filter Strip",null,"9.c. Sheetflow to Vegetated Filter Strip"]
["10.b. Wet Swale #2",null,"10.b. Wet Swale #2",null,null,null,"10.b. Wet Swale #2",null,null,{"$f":"P146","v":"10.b. Wet Swale #2"},null,"10.a. Wet Swale #1"]
["11.a. Filtering Practice #1",null,"11.a. Filtering Practice #1",null,null,null,"11.a. Filtering Practice #1",null,null,"11.a. Filtering Practice #1",null,{"$f":"P147","v":"11.a. Filtering Practice #1"}]
["11.b. Filtering Practice #2",null,"11.b. Filtering Practice #2",null,null,null,"11.b. Filtering Practice #2",null,null,"11.b. Filtering Practice #2",null,"11.b. Filtering Practice #2"]
["12.a. Constructed Wetland #1",null,"12.a. Constructed Wetland #1",null,null,null,"12.a. Constructed Wetland #1",null,null,"12.a. Constructed Wetland #1",null,"12.a. Constructed Wetland #1"]
["12.b. Constructed Wetland #2",null,"12.b. Constructed Wetland #2",null,null,null,"12.b. Constructed Wetland #2",null,null,"12.b. Constructed Wetland #2",null,"12.b. Constructed Wetland #2"]
["13.a. Wet Pond #1",null,"13.a. Wet Pond #1",null,null,null,"13.a. Wet Pond #1",null,null,"13.a. Wet Pond #1",null,"13.a. Wet Pond #1"]
["13.b. Wet Pond #1 (Coastal Plain)",null,"13.b. Wet Pond #1 (Coastal Plain)",null,null,null,"13.b. Wet Pond #1 (Coastal Plain)",null,null,"13.b. Wet Pond #1 (Coastal Plain)",null,"13.b. Wet Pond #1 (Coastal Plain)"]
["13.c. Wet Pond #2",null,"13.c. Wet Pond #2",null,null,null,"13.c. Wet Pond #2",null,null,"13.c. Wet Pond #2",null,"13.c. Wet Pond #2"]
["13.d. Wet Pond #2 (Coastal Plain)",null,"13.d. Wet Pond #2 (Coastal Plain)",null,null,null,"13.d. Wet Pond #2 (Coastal Plain)",null,null,"13.d. Wet Pond #2 (Coastal Plain)",null,"13.d. Wet Pond #2 (Coastal Plain)"]
["14.a. MTD - Hydrodynamic",null,"14.a. MTD - Hydrodynamic",null,null,null,"14.a. MTD - Hydrodynamic",null,null,"14.a. MTD - Hydrodynamic",null,"14.a. MTD - Hydrodynamic"]
["14.b. MTD - Filtering",null,"14.b. MTD - Filtering",null,null,null,"14.b. MTD - Filtering",null,null,"14.b. MTD - Filtering",null,"14.b. MTD - Filtering"]
["14.c. MTD - Generic",null,"14.c. MTD - Generic",null,null,null,"14.c. MTD - Generic",null,null,"14.c. MTD - Generic",null,"14.c. MTD - Generic"]
[]
[null,null,null,null,"Options for 12.a.  Constructed Wetland #1",null,"Options for 12.b.  Constructed Wetland #2"]
["Options for 11 A.  Filtering Practice #1",null,"Options for 11 b.  Filtering Practice #2",null,null,null,null,null,null,"Options for 13.a.  Wet Pond #1"]
[null,null,null,null,{"$f":"P120","v":"None"},null,{"$f":"P120","v":"None"},null,null,{"$f":"P120","v":"None"},null,"Options for 13.b.  Wet Pond #1 (Coastal Plain)"]
[{"$f":"P120","v":"None"},null,{"$f":"P120","v":"None"},null,{"$f":"P131","v":"4.a. Grass Channel A/B Soils"},null,{"$f":"P131","v":"4.a. Grass Channel A/B Soils"},null,null,{"$f":"P131","v":"4.a. Grass Channel A/B Soils"},null,{"$f":"P120","v":"None"}]
[{"$f":"P131","v":"4.a. Grass Channel A/B Soils"},null,{"$f":"P131","v":"4.a. Grass Channel A/B Soils"},null,"4.b. Grass Channel C/D Soils",null,"4.b. Grass Channel C/D Soils",null,null,"4.b. Grass Channel C/D Soils",null,{"$f":"P131","v":"4.a. Grass Channel A/B Soils"}]
["4.b. Grass Channel C/D Soils",null,"4.b. Grass Channel C/D Soils",null,"4.c. Grass Channel Compost Amended Soils",null,"4.c. Grass Channel Compost Amended Soils",null,null,"4.c. Grass Channel Compost Amended Soils",null,"4.b. Grass Channel C/D Soils"]
["4.c. Grass Channel Compost Amended Soils",null,"4.c. Grass Channel Compost Amended Soils",null,"5.a. Dry Swale #1",null,"5.a. Dry Swale #1",null,null,"5.a. Dry Swale #1",null,"4.c. Grass Channel Compost Amended Soils"]
["5.a. Dry Swale #1",null,"5.a. Dry Swale #1",null,"5.b. Dry Swale #2",null,"5.b. Dry Swale #2",null,null,"5.b. Dry Swale #2",null,"5.a. Dry Swale #1"]
["5.b. Dry Swale #2",null,"5.b. Dry Swale #2",null,"6.a. Bioretention #1",null,"6.a. Bioretention #1",null,null,"6.a. Bioretention #1",null,"5.b. Dry Swale #2"]
["6.a. Bioretention #1",null,"6.a. Bioretention #1",null,"6.b. Bioretention #2",null,"6.b. Bioretention #2",null,null,"6.b. Bioretention #2",null,"6.a. Bioretention #1"]
["6.b. Bioretention #2",null,"6.b. Bioretention #2",null,"7.a. Infiltration #1",null,"7.a. Infiltration #1",null,null,"7.a. Infiltration #1",null,"6.b. Bioretention #2"]
["7.a. Infiltration #1",null,"7.a. Infiltration #1",null,"7.b. Infiltration #2",null,"7.b. Infiltration #2",null,null,"7.b. Infiltration #2",null,"7.a. Infiltration #1"]
["7.b. Infiltration #2",null,"7.b. Infiltration #2",null,"8.a. ED #1",null,"8.a. ED #1",null,null,"8.a. ED #1",null,"7.b. Infiltration #2"]
["8.a. ED #1",null,"8.a. ED #1",null,"8.b. ED #2",null,"8.b. ED #2",null,null,"8.b. ED #2",null,"8.a. ED #1"]
["8.b. ED #2",null,"8.b. ED #2",null,"9.a. Sheetflow to A/B Soil Conservation Area ",null,"9.a. Sheetflow to A/B Soil Conservation Area ",null,null,"9.a. Sheetflow to A/B Soil Conservation Area ",null,"8.b. ED #2"]
["9.a. Sheetflow to A/B Soil Conservation Area ",null,"9.a. Sheetflow to A/B Soil Conservation Area ",null,"9.b. Sheetflow to C/D Soil Conservation Area",null,"9.b. Sheetflow to C/D Soil Conservation Area",null,null,"9.b. Sheetflow to C/D Soil Conservation Area",null,"9.a. Sheetflow to A/B Soil Conservation Area "]
["9.b. Sheetflow to C/D Soil Conservation Area",null,"9.b. Sheetflow to C/D Soil Conservation Area",null,"9.c. Sheetflow to Vegetated Filter Strip",null,"9.c. Sheetflow to Vegetated Filter Strip",null,null,"9.c. Sheetflow to Vegetated Filter Strip",null,"9.b. Sheetflow to C/D Soil Conservation Area"]
["9.c. Sheetflow to Vegetated Filter Strip",null,"9.c. Sheetflow to Vegetated Filter Strip",null,"10.a. Wet Swale #1",null,"10.a. Wet Swale #1",null,null,"10.a. Wet Swale #1",null,"9.c. Sheetflow to Vegetated Filter Strip"]
["10.a. Wet Swale #1",null,"10.a. Wet Swale #1",null,"10.b. Wet Swale #2",null,"10.b. Wet Swale #2",null,null,"10.b. Wet Swale #2",null,"10.a. Wet Swale #1"]
["10.b. Wet Swale #2",null,"10.b. Wet Swale #2",null,"11.a. Filtering Practice #1",null,"11.a. Filtering Practice #1",null,null,"11.a. Filtering Practice #1",null,"10.b. Wet Swale #2"]
[{"$f":"P148","v":"11.b. Filtering Practice #2"},null,"11.a. Filtering Practice #1",null,"11.b. Filtering Practice #2",null,"11.b. Filtering Practice #2",null,null,"11.b. Filtering Practice #2",null,"11.a. Filtering Practice #1"]
["12.a. Constructed Wetland #1",null,{"$f":"P149","v":"12.a. Constructed Wetland #1"},null,{"$f":"P150","v":"12.b. Constructed Wetland #2"},null,"12.a. Constructed Wetland #1",null,null,"12.a. Constructed Wetland #1",null,"11.b. Filtering Practice #2"]
["12.b. Constructed Wetland #2",null,"12.b. Constructed Wetland #2",null,"13.a. Wet Pond #1",null,{"$f":"P151","v":"13.a. Wet Pond #1"},null,null,"12.b. Constructed Wetland #2",null,"12.a. Constructed Wetland #1"]
["13.a. Wet Pond #1",null,"13.a. Wet Pond #1",null,"13.b. Wet Pond #1 (Coastal Plain)",null,"13.b. Wet Pond #1 (Coastal Plain)",null,null,{"$f":"P153","v":"13.c. Wet Pond #2"},null,"12.b. Constructed Wetland #2"]
["13.b. Wet Pond #1 (Coastal Plain)",null,"13.b. Wet Pond #1 (Coastal Plain)",null,"13.c. Wet Pond #2",null,"13.c. Wet Pond #2",null,null,{"$f":"P155","v":"14.a. MTD - Hydrodynamic"},null,{"$f":"P154","v":"13.d. Wet Pond #2 (Coastal Plain)"}]
["13.c. Wet Pond #2",null,"13.c. Wet Pond #2",null,"13.d. Wet Pond #2 (Coastal Plain)",null,"13.d. Wet Pond #2 (Coastal Plain)",null,null,{"$f":"P156","v":"14.b. MTD - Filtering"},null,{"$f":"P155","v":"14.a. MTD - Hydrodynamic"}]
["13.d. Wet Pond #2 (Coastal Plain)",null,"13.d. Wet Pond #2 (Coastal Plain)",null,"14.a. MTD - Hydrodynamic",null,"14.a. MTD - Hydrodynamic",null,null,{"$f":"P157","v":"14.c. MTD - Generic"},null,{"$f":"P156","v":"14.b. MTD - Filtering"}]
["14.a. MTD - Hydrodynamic",null,"14.a. MTD - Hydrodynamic",null,"14.b. MTD - Filtering",null,"14.b. MTD - Filtering",null,null,null,null,{"$f":"P157","v":"14.c. MTD - Generic"}]
["14.b. MTD - Filtering",null,"14.b. MTD - Filtering",null,"14.c. MTD - Generic",null,"14.c. MTD - Generic"]
["14.c. MTD - Generic",null,"14.c. MTD - Generic"]
[]
[]
["Options for 13.c.  Wet Pond #2",null,"Options for 13.d.  Wet Pond #2 (Coastal Plain)",null,"Options for 14.a.  Manufactured Device-Hydrodynamic",null,"Options for 14.b.  Manufactured Device-Filtering",null,null,null,"Options for 14.c.  Manufactured Device-Generic"]
[]
[{"$f":"P120","v":"None"},null,{"$f":"P120","v":"None"},null,{"$f":"P120","v":"None"},null,{"$f":"P120","v":"None"},null,null,null,{"$f":"P120","v":"None"}]
[{"$f":"P131","v":"4.a. Grass Channel A/B Soils"},null,{"$f":"P131","v":"4.a. Grass Channel A/B Soils"},null,{"$f":"P131","v":"4.a. Grass Channel A/B Soils"},null,{"$f":"P131","v":"4.a. Grass Channel A/B Soils"},null,null,null,{"$f":"P131","v":"4.a. Grass Channel A/B Soils"}]
["4.b. Grass Channel C/D Soils",null,"4.b. Grass Channel C/D Soils",null,"4.b. Grass Channel C/D Soils",null,"4.b. Grass Channel C/D Soils",null,null,null,"4.b. Grass Channel C/D Soils"]
["4.c. Grass Channel Compost Amended Soils",null,"4.c. Grass Channel Compost Amended Soils",null,"4.c. Grass Channel Compost Amended Soils",null,"4.c. Grass Channel Compost Amended Soils",null,null,null,"4.c. Grass Channel Compost Amended Soils"]
["5.a. Dry Swale #1",null,"5.a. Dry Swale #1",null,"5.a. Dry Swale #1",null,"5.a. Dry Swale #1",null,null,null,"5.a. Dry Swale #1"]
["5.b. Dry Swale #2",null,"5.b. Dry Swale #2",null,"5.b. Dry Swale #2",null,"5.b. Dry Swale #2",null,null,null,"5.b. Dry Swale #2"]
["6.a. Bioretention #1",null,"6.a. Bioretention #1",null,"6.a. Bioretention #1",null,"6.a. Bioretention #1",null,null,null,"6.a. Bioretention #1"]
["6.b. Bioretention #2",null,"6.b. Bioretention #2",null,"6.b. Bioretention #2",null,"6.b. Bioretention #2",null,null,null,"6.b. Bioretention #2"]
["7.a. Infiltration #1",null,"7.a. Infiltration #1",null,"7.a. Infiltration #1",null,"7.a. Infiltration #1",null,null,null,"7.a. Infiltration #1"]
["7.b. Infiltration #2",null,"7.b. Infiltration #2",null,"7.b. Infiltration #2",null,"7.b. Infiltration #2",null,null,null,"7.b. Infiltration #2"]
["8.a. ED #1",null,"8.a. ED #1",null,"8.a. ED #1",null,"8.a. ED #1",null,null,null,"8.a. ED #1"]
["8.b. ED #2",null,"8.b. ED #2",null,"8.b. ED #2",null,"8.b. ED #2",null,null,null,"8.b. ED #2"]
["9.a. Sheetflow to A/B Soil Conservation Area ",null,"9.a. Sheetflow to A/B Soil Conservation Area ",null,"9.a. Sheetflow to A/B Soil Conservation Area ",null,"9.a. Sheetflow to A/B Soil Conservation Area ",null,null,null,"9.a. Sheetflow to A/B Soil Conservation Area "]
["9.b. Sheetflow to C/D Soil Conservation Area",null,"9.b. Sheetflow to C/D Soil Conservation Area",null,"9.b. Sheetflow to C/D Soil Conservation Area",null,"9.b. Sheetflow to C/D Soil Conservation Area",null,null,null,"9.b. Sheetflow to C/D Soil Conservation Area"]
["9.c. Sheetflow to Vegetated Filter Strip",null,"9.c. Sheetflow to Vegetated Filter Strip",null,"9.c. Sheetflow to Vegetated Filter Strip",null,"9.c. Sheetflow to Vegetated Filter Strip",null,null,null,"9.c. Sheetflow to Vegetated Filter Strip"]
["10.a. Wet Swale #1",null,"10.a. Wet Swale #1",null,"10.a. Wet Swale #1",null,"10.a. Wet Swale #1",null,null,null,"10.a. Wet Swale #1"]
["10.b. Wet Swale #2",null,"10.b. Wet Swale #2",null,"10.b. Wet Swale #2",null,"10.b. Wet Swale #2",null,null,null,"10.b. Wet Swale #2"]
["11.a. Filtering Practice #1",null,"11.a. Filtering Practice #1",null,"11.a. Filtering Practice #1",null,"11.a. Filtering Practice #1",null,null,null,"11.a. Filtering Practice #1"]
["11.b. Filtering Practice #2",null,"11.b. Filtering Practice #2",null,"11.b. Filtering Practice #2",null,"11.b. Filtering Practice #2",null,null,null,"11.b. Filtering Practice #2"]
["12.a. Constructed Wetland #1",null,"12.a. Constructed Wetland #1",null,"12.a. Constructed Wetland #1",null,"12.a. Constructed Wetland #1",null,null,null,"12.a. Constructed Wetland #1"]
["12.b. Constructed Wetland #2",null,"12.b. Constructed Wetland #2",null,"12.b. Constructed Wetland #2",null,"12.b. Constructed Wetland #2",null,null,null,"12.b. Constructed Wetland #2"]
["13.a. Wet Pond #1",null,{"$f":"P152","v":"13.b. Wet Pond #1 (Coastal Plain)"},null,"13.a. Wet Pond #1",null,"13.a. Wet Pond #1",null,null,null,"13.a. Wet Pond #1"]
[{"$f":"P155","v":"14.a. MTD - Hydrodynamic"},null,{"$f":"P155","v":"14.a. MTD - Hydrodynamic"},null,"13.b. Wet Pond #1 (Coastal Plain)",null,"13.b. Wet Pond #1 (Coastal Plain)",null,null,null,"13.b. Wet Pond #1 (Coastal Plain)"]
[{"$f":"P156","v":"14.b. MTD - Filtering"},null,{"$f":"P156","v":"14.b. MTD - Filtering"},null,"13.c. Wet Pond #2",null,"13.c. Wet Pond #2",null,null,null,"13.c. Wet Pond #2"]
[{"$f":"P157","v":"14.c. MTD - Generic"},null,{"$f":"P157","v":"14.c. MTD - Generic"},null,"13.d. Wet Pond #2 (Coastal Plain)",null,"13.d. Wet Pond #2 (Coastal Plain)",null,null,null,"13.d. Wet Pond #2 (Coastal Plain)"]
[null,null,null,null,{"$f":"P156","v":"14.b. MTD - Filtering"}]

{"sheet":"Water Quality Compliance","index":6,"n_rows":31,"n_cols":24,"rows_kept":31,"cut":false,"hidden":false,"merged":[[14,22,14,23],[26,1,26,3],[25,5,26,8]]}
[null,"Site Results (Water Quality Compliance)",null,null,null,null,null,null,null,null,null,null,null,null,null,null,null,null,null,null,"error summary"]
[null,"Area Checks","D.A. A","D.A. B","D.A. C","D.A. D","D.A. E","AREA CHECK",null,null,null,null,null,null,null,null,null,null,null,null,"Area checks",{"$f":"COUNTIF(H4:H7,\"AREA EXCEEDED!\")","v":0}]
[null,"FOREST/OPEN SPACE (ac)",{"$f":"'D.A. A'!$F$5","v":0},{"$f":"'D.A. B'!$F$5","v":0},{"$f":"'D.A. C'!$F$5","v":0},{"$f":"'D.A. D'!$F$5","v":0},{"$f":"'D.A. E'!$F$5","v":0},{"$f":"IF(SUM(C3:G3)>Site!$F$24,\"AREA EXCEEDED!\",\"OK.\")","v":"OK."},null,null,null,null,null,null,null,null,null,null,null,null,"DA checks",{"$f":"COUNTIF(H5:H8,\"AREA EXCEEDED!\")","v":0}]
[null,"IMPERVIOUS COVER (ac)",{"$f":"'D.A. A'!$F$7","v":0},{"$f":"'D.A. B'!$F$7","v":0},{"$f":"'D.A. C'!$F$7","v":0},{"$f":"'D.A. D'!$F$7","v":0},{"$f":"'D.A. E'!$F$7","v":0},{"$f":"IF(SUM(C4:G4)>Site!$F$26,\"AREA EXCEEDED!\",\"OK.\")","v":"OK."},null,null,null,null,null,null,null,null,null,null,null,null,"total",{"$f":"SUM(V2:V3)","v":0}]
[null,"IMPERVIOUS COVER TREATED (ac)",{"$f":"'D.A. A'!$F$96","v":0},{"$f":"'D.A. B'!$F$96","v":0},{"$f":"'D.A. C'!$F$96","v":0},{"$f":"'D.A. D'!$F$96","v":0},{"$f":"'D.A. E'!$F$96","v":0},{"$f":"IF(SUM(C5:G5)>SUM('D.A. A'!F7,'D.A. B'!F7,'D.A. C'!F7,'D.A. D'!F7,'D.A. E'!F7),\"AREA EXCEEDED!\",\"OK.\")","v":"OK."}]
[null,"MANAGED TURF AREA (ac)",{"$f":"'D.A. A'!$F$6","v":0},{"$f":"'D.A. B'!$F$6","v":0},{"$f":"'D.A. C'!$F$6","v":0},{"$f":"'D.A. D'!$F$6","v":0},{"$f":"'D.A. E'!$F$6","v":0},{"$f":"IF(SUM(C6:G6)>Site!$F$25,\"AREA EXCEEDED!\",\"OK.\")","v":"OK."}]
[null,"MANAGED TURF AREA TREATED (ac)",{"$f":"'D.A. A'!$F$97","v":0},{"$f":"'D.A. B'!$F$97","v":0},{"$f":"'D.A. C'!$F$97","v":0},{"$f":"'D.A. D'!$F$97","v":0},{"$f":"'D.A. E'!$F$97","v":0},{"$f":"IF(SUM(C7:G7)>SUM('D.A. A'!F6,'D.A. B'!F6,'D.A. C'!F6,'D.A. D'!F6,'D.A. E'!F6),\"AREA EXCEEDED!\",\"OK.\")","v":"OK."}]
[null,"AREA CHECK  ",{"$f":"IF(C5>C4,\"AREA EXCEEDED!\",IF(C7>C6,\"AREA EXCEEDED!\",\"OK.\"))","v":"OK."},{"$f":"IF(D5>D4,\"AREA EXCEEDED!\",IF(D7>D6,\"AREA EXCEEDED!\",\"OK.\"))","v":"OK."},"OK.","OK.","OK."]
[null,null,null,null,null,null,{"$f":"IF(COUNTIF(C4:G4,\"=ERROR!\")>0,\"ERROR!: CHECK SITE DATA TAB\",IF(COUNTIF(C6:G6,\"=ERROR!\")>0,\"ERROR!: CHECK SITE DATA TAB\",\"\"))","v":""}]
[null,"Site Treatment Volume (ft3)",{"$f":"Site!$F$55","v":"--"},{"$f":"IF(C10=\"x\",\"Check Site tab for errors!\",\"\")","v":""}]
[]
[null,"Runoff Reduction Volume and TP By Drainage Area"]
[null,null,"D.A. A","D.A. B","D.A. C","D.A. D","D.A. E","TOTAL"]
[null,"RUNOFF REDUCTION VOLUME ACHIEVED (ft3)",{"$f":"'D.A. A'!$F$60","v":0},{"$f":"'D.A. B'!$F$60","v":0},{"$f":"'D.A. C'!$F$60","v":0},{"$f":"'D.A. D'!$F$60","v":0},{"$f":"'D.A. E'!$F$60","v":0},{"$f":"SUM(C14:G14)","v":0}]
[null,"TP LOAD AVAILABLE FOR REMOVAL  (lb/yr)",{"$f":"'D.A. A'!$M$7","v":0},{"$f":"'D.A. B'!$M$7","v":0},{"$f":"'D.A. C'!$M$7","v":0},{"$f":"'D.A. D'!$M$7","v":0},{"$f":"'D.A. E'!$M$7","v":0},{"$f":"SUM(C15:G15)","v":0},null,null,null,null,null,null,null,null,null,null,null,null,null,null,"Project:"]
[null,"TP LOAD REDUCTION ACHIEVED  (lb/yr)",{"$f":"'D.A. A'!$I$104","v":0},{"$f":"'D.A. B'!$I$104","v":0},{"$f":"'D.A. C'!$I$104","v":0},{"$f":"'D.A. D'!$I$104","v":0},{"$f":"'D.A. E'!$I$104","v":0},{"$f":"SUM(C16:G16)","v":0},null,null,null,null,null,null,null,null,null,null,null,null,"Reduction",null,"Regular","Linear"]
[null,"TP LOAD REMAINING  (lb/yr)",{"$f":"C15-C16","v":0},{"$f":"D15-D16","v":0},0,0,0,{"$f":"SUM(C17:G17)","v":0},null,null,null,null,null,null,null,null,null,null,null,null,"required",null,{"$f":"C23","v":"--"},{"$f":"E23","v":""}]
[null,null,null,null,null,null,null,null,null,null,null,null,null,null,null,null,null,null,null,null,"achieved",null,{"$f":"C24","v":"--"},{"$f":"E24","v":""}]
[null,"NITROGEN LOAD REDUCTION ACHIEVED  (lb/yr)",{"$f":"'D.A. A'!$I$111","v":0},{"$f":"'D.A. B'!$I$111","v":0},{"$f":"'D.A. C'!$I$111","v":0},{"$f":"'D.A. D'!$I$111","v":0},{"$f":"'D.A. E'!$I$111","v":0},{"$f":"SUM(C19:G19)","v":0}]
[null,null,null,null,null,null,null,null,null,null,null,null,null,null,null,null,null,null,null,null,"req-ach",null,{"$f":"W17-W18","v":{"$error":"#VALUE!"}},{"$f":"X17-X18","v":{"$error":"#VALUE!"}}]
[null,"Total Phosphorus  ",null,null,"LINEAR PROJECT:",null,null,null,null,null,null,null,null,null,null,null,null,null,null,null,"req>ach?",null,{"$f":"W17>W18","v":false},{"$f":"X17>X18","v":false}]
[null,"FINAL POST-DEVELOPMENT TP LOAD (lb/yr)",{"$f":"IF(Site!$E$6=\"yes\",\"--\",Site!$F$56)","v":"--"},null,{"$f":"IF(Site!$E$6=\"yes\",Site!$F$56,\"\")","v":""},null,null,null,null,null,null,null,null,null,null,null,null,null,null,null,"abs(req-ach)>=0.005?",null,{"$f":"ABS(W17-W18)>=0.005","v":{"$error":"#VALUE!"}},{"$f":"ABS(X17-X18)>=0.005","v":{"$error":"#VALUE!"}}]
[null,"TP LOAD REDUCTION REQUIRED (lb/yr)",{"$f":"IF(OR(Site!$E$6=\"yes\",$C$22=\"--\"),\"--\",IF(OR(Site!$P$5>0,$V$4>0),\"x\",Site!$G$63))","v":"--"},null,{"$f":"IF(OR($E$22=\"\",$E$22=\"--\"),$E$22,IF(OR(Site!$P$5>0,$V$4>0),\"x\",Site!$G$64))","v":""}]
[null,"TP LOAD REDUCTION ACHIEVED  (lb/yr)",{"$f":"IF(OR($C$23=\"--\",$C$23=\"x\"),$C$23,$H$16)","v":"--"},null,{"$f":"IF($E$22=\"\", $E$22,IF(OR($E$23=\"--\",$E$23=\"x\"),$E$23,$H$16))","v":""}]
[null,"TP LOAD REMAINING (lb/yr):",{"$f":"IF(OR($C$23=\"--\",$C$23=\"x\"),$C$23,$C$22-$C$24)","v":"--"},null,{"$f":"IF($E$22=\"\",$E$22,IF(OR($E$23=\"--\",$E$23=\"x\"),$E$23,$E$22-$E$24))","v":""},null,null,null,null,null,null,null,null,null,null,null,null,null,null,null,null,null,{"$f":"\"--\"","v":"--"}]
[null,"REMAINING TP LOAD REDUCTION REQUIRED (lb/yr):",{"$f":"IF($C$23=\"--\",\"--\",IF(OR($C$23=\"x\",$H$3=\"AREA EXCEEDED!\"),\"CHECK AREAS!\",IF($C$23>$C$24,$C$23-$C$24,0)))","v":"--"},{"$f":"IF($B$27=\"\",\"\",\"**\")","v":""},{"$f":"IF($E$22=\"\",\"\",IF($E$23=\"--\",\"--\",IF(OR($E$23=\"x\",$H$3=\"AREA EXCEEDED!\"),\"CHECK AREAS!\",IF($E$23>$E$24,$E$23-$E$24,0))))","v":""},{"$f":"IF(OR($E$22=\"\",$E$22=\"--\",E$22=\"x\",$V$4>0),\"\",IF(AND($X$21=TRUE,$X$22=TRUE),\"\",IF(AND($X$21=FALSE,$X$22=FALSE),\"**No further TP load reduction required\",IF(AND($X$21=FALSE,$X$22=TRUE),\"** TARGET TP REDUCTION EXCEEDED BY \"&ROUND($E$24-$E$23,2)&\" LB/YEAR **\",\"**No further TP load reduction required\n(Required - Achieved < 0.005 lb/yr)\"))))","v":""}]
[null,{"$f":"IF(OR(Site!$E$6=\"yes\",Site!$G$63=\"--\",$C$26=\"CHECK AREAS!\"),\"\",IF(AND($W$21=TRUE,$W$22=TRUE),\"\",IF(AND($W$21=FALSE,$W$22=FALSE),\"**No further TP load reduction required\",IF(AND($W$21=FALSE,$W$22=TRUE),\"** TARGET TP REDUCTION EXCEEDED BY \"&ROUND($C$24-$C$23,2)&\" LB/YEAR **\",\"**No further TP load reduction required \n(Required - Achieved < 0.005 lb/yr)\"))))","v":""}]
[null,"Total Nitrogen (For Information Purposes)"]
[null,"POST-DEVELOPMENT LOAD (lb/yr)",{"$f":"IF(Site!$F$13=\"--\",\"--\",IF(Site!$I$67=Site!$O$2,\"x\",Site!$I$67))","v":"--"}]
[null,"NITROGEN LOAD REDUCTION ACHIEVED  (lb/yr)",{"$f":"IF(OR($C$29=\"--\",$C$29=\"x\"),$C$29,$H$19)","v":"--"}]
[null,"REMAINING POST-DEVELOPMENT NITROGEN LOAD (lb/yr)",{"$f":"IF(OR($C$29=\"--\",$C$29=\"x\"),$C$29,$C$29-$C$30)","v":"--"}]

{"sheet":"Runoff Volume and CN","index":7,"n_rows":666,"n_cols":29,"rows_kept":666,"cut":false,"hidden":false,"merged":[[79,10,80,10],[9,2,11,11],[12,2,15,11],[16,2,17,11],[3,5,3,7],[78,2,78,3],[47,2,47,4],[55,2,56,3],[69,2,70,3],[74,2,74,4],[75,2,75,4],[51,2,52,3],[65,2,66,3],[51,10,52,10],[65,10,66,10],[46,2,46,4],[89,2,89,4],[79,2,80,3],[81,2,82,3],[83,2,84,3],[88,2,88,4],[53,2,54,3],[39,2,40,3],[67,2,68,3],[61,2,61,4],[50,2,50,3],[64,2,64,3],[60,2,60,4],[41,2,42,3],[37,10,38,10],[7,2,7,4],[6,2,6,3],[23,10,24,10],[36,2,36,3],[37,2,38,3],[20,2,20,12],[33,2,33,4],[27,2,28,3],[22,2,22,3],[32,2,32,4],[25,2,26,3],[23,2,24,3]]}
[]
[null,null,null,null,null,null,"Runoff Volume and Curve Number Calculations",null,null,null,null,null,null,null,"These values are used for",null,null," Range  :  1               2                 3                4                 5                 6                7  "]
[null,null,null,null,null,null,null,null,null,null,null,null,null,null,"computing \"qu\" by equation",null,null,"  Ia / P :",0.1,0.3,0.35,0.4,0.45,0.5]
[null,null,null,null,null,"Enter design storm rainfall depths (in):",null,null,null,null,null,null,null,null,"in Appendix F of TR-55.",null,null,"C0 :",2.5532300000000001,2.4653200000000002,2.4189600000000002,2.36409,2.2923800000000001,2.20282]
[null,null,null,null,null,"1-year storm","2-year storm","10-year storm",null,null,null,null,null,null,"The formulas automatically",null,null,"C1 :",-0.61512,-0.62256999999999996,-0.61594000000000004,-0.59857000000000005,-0.57004999999999995,-0.51598999999999995]
[null,null,null,null,{"$f":"IF(SUM(F6:H6)=0,\"→\",\"\")","v":"→"},0,0,0,{"$f":"IF(SUM(F6:H6)=0,\"←\",\"\")","v":"←"},null,null,null,null,null,"interpolate for C0, C1 & C2.",null,null,"C2 :",-0.16403000000000001,-0.11656999999999999,-8.8200000000000001E-2,-5.6210000000000003E-2,-2.281E-2,-1.259E-2]
[]
[]
[null,null,"*Notes (see below):"]
[null,null,"[1] The curve numbers and runoff volumes computed in this spreadsheet for each drainage area are limited in their applicability for determining and demonstrating compliance with water quantity requirements. See VRRM User's Guide and Documentation for additional information."]
[]
[]
[null,null,"[2] Runoff Volume (RV) for pre- and post-development drainage areas must be in volumetric units (e.g., acre-feet or cubic feet) when using the Energy Balance Equation. Runoff measured in watershed-inches and shown in the spreadsheet as RV(watershed-inch) can only be used in the Energy Balance Equation when the pre- and post-development drainage areas are equal. Otherwise RV(watershed-inch) must be multiplied by the drainage area."]
[]
[]
[]
[null,null,"[3] Adjusted CNs are based on runoff reduction volumes as calculated in D.A. tabs. An alternative CN adjustment calculation for Vegetated Roofs is included in BMP specification No. 5."]
[]
[]
[null,null,null,null,null,null,null,null,null,null,null,null,null,null,"1-year","2-year","10-year"]
[null,null,"Drainage Area Curve Numbers and Runoff Depths*\nCurve numbers (CN, CNadj) and runoff depths (RVDeveloped) are computed with and without reduction practices.",null,null,null,null,null,null,null,null,null,null,null,"v",null,null,"CN","S"]
[]
[null,null,"Drainage Area A",null,null,"A Soils","B Soils","C Soils","D Soils",null,"Total Area (acres):",{"$f":"'D.A. A'!F8","v":0},null,null,null,{"$f":"IF(G$6>0.2*($S23),(G$6-0.2*($S23))^2/(G$6+0.8*($S23)),0)","v":0},{"$f":"IF(H$6>0.2*($S23),(H$6-0.2*($S23))^2/(H$6+0.8*($S23)),0)","v":0},40,{"$f":"IF(R23>0,1000/R23-10,1000)","v":15}]
[null,null,"Forest/Open Space -- undisturbed, protected forest/open space or reforested land",null,"Area (acres)",{"$f":"'D.A. A'!B$5","v":0},{"$f":"'D.A. A'!C$5","v":0},{"$f":"'D.A. A'!D$5","v":0},{"$f":"'D.A. A'!E$5","v":0},null,"Runoff Reduction Volume (ft3):",null,null,null,null,0,0,{"$f":"R23+0.1","v":40.1},14.937655860349125]
[null,null,null,null,"CN",30,55,70,77,null,null,{"$f":"'D.A. A'!F60","v":0},null,null,null,0,0,40.200000000000003,14.875621890547261]
[null,null,"Managed Turf -- disturbed, graded for yards or other turf to be mowed/managed",null,"Area (acres)",{"$f":"'D.A. A'!B$6","v":0},{"$f":"'D.A. A'!C$6","v":0},{"$f":"'D.A. A'!D$6","v":0},{"$f":"'D.A. A'!E$6","v":0},null,null,null,null,null,null,0,0,40.300000000000004,14.813895781637715]
[null,null,null,null,"CN",39,61,74,80,null,null,null,null,null,null,0,0,40.400000000000006,14.75247524752475]
[null,null,"Impervious Cover ",null,"Area (acres)",{"$f":"'D.A. A'!B$7","v":0},{"$f":"'D.A. A'!C$7","v":0},{"$f":"'D.A. A'!D$7","v":0},{"$f":"'D.A. A'!E$7","v":0},null,null,null,null,null,null,0,0,40.500000000000007,14.691358024691354]
[null,null,null,null,"CN",98,98,98,98,null,null,null,null,null,null,0,0,40.600000000000009,14.630541871921178]
[null,null,null,null,null,null,null,null,"CN(D.A. A)",null,null,null,null,null,null,0,0,40.70000000000001,14.570024570024565,null,null,"Drainage Area A:"]
[null,null,null,null,null,null,null,null,{"$f":"ROUND(IF(L23>0,(SUMPRODUCT(F24:I24,F25:I25)+SUMPRODUCT(F26:I26,F27:I27)+SUMPRODUCT(F28:I28,F29:I29))/L23,0),0)","v":0},null,null,null,null,null,null,0,0,40.800000000000011,14.509803921568622]
[null,null,null,null,null,"1-year storm","2-year storm","10-year storm",null,null,null,null,null,null,null,0,0,40.900000000000013,14.44987775061124,null,null,"S (in)"]
[null,null,"RVDeveloped (watershed-inch) with no Runoff Reduction*",null,null,{"$f":"IF(F$6>0.2*($V33),(F$6-0.2*($V33))^2/(F$6+0.8*($V33)),0)","v":0},{"$f":"IF(G$6>0.2*($V33),(G$6-0.2*($V33))^2/(G$6+0.8*($V33)),0)","v":0},{"$f":"IF(H$6>0.2*($V33),(H$6-0.2*($V33))^2/(H$6+0.8*($V33)),0)","v":0},null,null,null,null,null,null,null,0,0,41.000000000000014,14.390243902439018,null,null,{"$f":"IF(I31>0,1000/I31-10,1000)","v":1000}]
[null,null,"RVDeveloped (watershed-inch) with Runoff Reduction*",null,null,{"$f":"IF($L23>0,IF(F33>0,(IFERROR(MAX(F33-$L25/3630/$L23,0),\"Check Areas!\")),F33),F33)","v":0},{"$f":"IF($L23>0,IF(G33>0,(IFERROR(MAX(G33-$L25/3630/$L23,0),\"Check Areas!\")),G33),G33)","v":0},{"$f":"IF($L23>0,IF(H33>0,(IFERROR(MAX(H33-$L25/3630/$L23,0),\"Check Areas!\")),H33),H33)","v":0},null,null,null,null,null,null,null,0,0,41.100000000000016,14.330900243308992]
[null,null,null,null,"Adjusted CN*",{"$f":"IF($L23>0,VLOOKUP(F34,O$23:$S$666,4),0)","v":0},{"$f":"IF($L23>0,VLOOKUP(G34,P$23:$S$666,3),0)","v":0},{"$f":"IF($L23>0,VLOOKUP(H34,Q$23:$S$666,2),0)","v":0},null,null,null,null,null,null,null,0,0,41.200000000000017,14.271844660194166,null,null,null,null,null,null,null,null,null,"….\n"]
[null,null,null,null,"*See Notes above",null,null,null,null,null,null,null,null,null,null,0,0,41.300000000000018,14.213075060532677]
[null,null,"Drainage Area B",null,null,"A Soils","B Soils","C Soils","D Soils",null,"Total Area (acres):",{"$f":"'D.A. B'!F8","v":0},null,null,null,0,0,41.40000000000002,14.154589371980666]
[null,null,"Forest/Open Space -- undisturbed, protected forest/open space or reforested land",null,"Area (acres)",{"$f":"'D.A. B'!B$5","v":0},{"$f":"'D.A. B'!C$5","v":0},{"$f":"'D.A. B'!D$5","v":0},{"$f":"'D.A. B'!E$5","v":0},null,"Runoff Reduction Volume (ft3):",null,null,null,null,0,0,41.500000000000021,14.096385542168662]
[null,null,null,null,"CN",30,55,70,77,null,null,{"$f":"'D.A. B'!F60","v":0},null,null,null,0,0,41.600000000000023,14.038461538461526]
[null,null,"Managed Turf -- disturbed, graded for yards or other turf to be mowed/managed",null,"Area (acres)",{"$f":"'D.A. B'!B$6","v":0},{"$f":"'D.A. B'!C$6","v":0},{"$f":"'D.A. B'!D$6","v":0},{"$f":"'D.A. B'!E$6","v":0},null,null,null,null,null,null,0,0,41.700000000000024,13.980815347721808]
[null,null,null,null,"CN",39,61,74,80,null,null,null,null,null,null,0,0,41.800000000000026,13.923444976076539]
[null,null,"Impervious Cover ",null,"Area (acres)",{"$f":"'D.A. B'!B$7","v":0},{"$f":"'D.A. B'!C$7","v":0},{"$f":"'D.A. B'!D$7","v":0},{"$f":"'D.A. B'!E$7","v":0},null,null,null,null,null,null,0,0,41.900000000000027,13.866348448687337]
[null,null,null,null,"CN",98,98,98,98,null,null,null,null,null,null,0,0,42.000000000000028,13.809523809523792]
[null,null,null,null,null,null,null,null,"CN(D.A. B)",null,null,null,null,null,null,0,0,42.10000000000003,13.752969121140126,null,null,"Drainage Area B:"]
[null,null,null,null,null,null,null,null,{"$f":"ROUND(IF(L37>0,(SUMPRODUCT(F38:I38,F39:I39)+SUMPRODUCT(F40:I40,F41:I41)+SUMPRODUCT(F42:I42,F43:I43))/L37,0),0)","v":0},null,null,null,null,null,null,0,0,42.200000000000031,13.696682464454959]
[null,null,null,null,null,"1-year storm","2-year storm","10-year storm",null,null,null,null,null,null,null,0,0,42.300000000000033,13.640661938534262,null,null,"S (in)"]
[null,null,"RVDeveloped (watershed-inch) with no Runoff Reduction*",null,null,{"$f":"IF(F$6>0.2*($V47),(F$6-0.2*($V47))^2/(F$6+0.8*($V47)),0)","v":0},{"$f":"IF(G$6>0.2*($V47),(G$6-0.2*($V47))^2/(G$6+0.8*($V47)),0)","v":0},{"$f":"IF(H$6>0.2*($V47),(H$6-0.2*($V47))^2/(H$6+0.8*($V47)),0)","v":0},null,null,null,null,null,null,null,0,0,42.400000000000034,13.584905660377341,null,null,{"$f":"IF(I45>0,1000/I45-10,1000)","v":1000}]
[null,null,"RVDeveloped (watershed-inch) with Runoff Reduction*",null,null,{"$f":"IF(F47>0,IF($L37>0,(IFERROR(MAX(F47-$L39/3630/$L37,0),\"Check Areas!\")),F47),F47)","v":0},{"$f":"IF($L37>0,IF(G47>0,(IFERROR(MAX(G47-$L39/3630/$L37,0),\"Check Areas!\")),G47),G47)","v":0},{"$f":"IF($L37>0,IF(H47>0,(IFERROR(MAX(H47-$L39/3630/$L37,0),\"Check Areas!\")),H47),H47)","v":0},null,null,null,null,null,null,null,0,0,42.500000000000036,13.529411764705863]
[null,null,null,null,"Adjusted CN*",{"$f":"IF($L37>0,VLOOKUP(F48,O$23:$S$666,4),0)","v":0},{"$f":"IF($L37>0,VLOOKUP(G48,P$23:$S$666,3),0)","v":0},{"$f":"IF($L37>0,VLOOKUP(H48,Q$23:$S$666,2),0)","v":0},null,null,null,null,null,null,{"$f":"IF(F$6>0.2*($S49),(F$6-0.2*($S49))^2/(F$6+0.8*($S49)),0)","v":0},0,0,42.600000000000037,13.474178403755847]
[null,null,null,null,"*See Notes above",null,null,null,null,null,null,null,null,null,0,0,0,42.700000000000038,13.419203747072579]
[null,null,"Drainage Area C",null,null,"A Soils","B Soils","C Soils","D Soils",null,"Total Area (acres):",{"$f":"'D.A. C'!F8","v":0},null,null,0,0,0,42.80000000000004,13.364485981308391]
[null,null,"Forest/Open Space -- undisturbed, protected forest/open space or reforested land",null,"Area (acres)",{"$f":"'D.A. C'!B$5","v":0},{"$f":"'D.A. C'!C$5","v":0},{"$f":"'D.A. C'!D$5","v":0},{"$f":"'D.A. C'!E$5","v":0},null,"Runoff Reduction Volume (ft3):",null,null,null,0,0,0,42.900000000000041,13.310023310023286]
[null,null,null,null,"CN",30,55,70,77,null,null,{"$f":"'D.A. C'!F60","v":0},null,null,0,0,0,43.000000000000043,13.255813953488349]
[null,null,"Managed Turf -- disturbed, graded for yards or other turf to be mowed/managed",null,"Area (acres)",{"$f":"'D.A. C'!B$6","v":0},{"$f":"'D.A. C'!C$6","v":0},{"$f":"'D.A. C'!D$6","v":0},{"$f":"'D.A. C'!E$6","v":0},null,null,null,null,null,0,0,0,43.100000000000044,13.201856148491856]
[null,null,null,null,"CN",39,61,74,80,null,null,null,null,null,0,{"$f":"IF(G$6>0.2*($S55),(G$6-0.2*($S55))^2/(G$6+0.8*($S55)),0)","v":0},{"$f":"IF(H$6>0.2*($S55),(H$6-0.2*($S55))^2/(H$6+0.8*($S55)),0)","v":0},43.200000000000045,{"$f":"IF(R55>0,1000/R55-10,1000)","v":13.148148148148124}]
[null,null,"Impervious Cover ",null,"Area (acres)",{"$f":"'D.A. C'!B$7","v":0},{"$f":"'D.A. C'!C$7","v":0},{"$f":"'D.A. C'!D$7","v":0},{"$f":"'D.A. C'!E$7","v":0},null,null,null,null,null,0,0,0,{"$f":"R55+0.1","v":43.300000000000047},13.094688221708982]
[null,null,null,null,"CN",98,98,98,98,null,null,null,null,null,0,0,0,43.400000000000048,13.041474654377854]
[null,null,null,null,null,null,null,null,"CN(D.A. C)",null,null,null,null,null,0,0,0,43.50000000000005,12.98850574712641,null,null,"Drainage Area C:"]
[null,null,null,null,null,null,null,null,{"$f":"ROUND(IF(L51>0,(SUMPRODUCT(F52:I52,F53:I53)+SUMPRODUCT(F54:I54,F55:I55)+SUMPRODUCT(F56:I56,F57:I57))/L51,0),0)","v":0},null,null,null,null,null,0,0,0,43.600000000000051,12.935779816513733]
[null,null,null,null,null,"1-year storm","2-year storm","10-year storm",null,null,null,null,null,null,0,0,0,43.700000000000053,12.88329519450798,null,null,"S (in)"]
[null,null,"RVDeveloped (watershed-inch) with no Runoff Reduction*",null,null,{"$f":"IF(F$6>0.2*($V61),(F$6-0.2*($V61))^2/(F$6+0.8*($V61)),0)","v":0},{"$f":"IF(G$6>0.2*($V61),(G$6-0.2*($V61))^2/(G$6+0.8*($V61)),0)","v":0},{"$f":"IF(H$6>0.2*($V61),(H$6-0.2*($V61))^2/(H$6+0.8*($V61)),0)","v":0},null,null,null,null,null,null,0,0,0,43.800000000000054,12.831050228310474,null,null,{"$f":"IF(I59>0,1000/I59-10,1000)","v":1000}]
[null,null,"RVDeveloped (watershed-inch) with Runoff Reduction*",null,null,{"$f":"IF($L51>0,IF(F61>0,(IFERROR(MAX(F61-$L53/3630/$L51,0),\"Check Areas!\")),F61),F61)","v":0},{"$f":"IF($L51>0,IF(G61>0,(IFERROR(MAX(G61-$L53/3630/$L51,0),\"Check Areas!\")),G61),G61)","v":0},{"$f":"IF($L51>0,IF(H61>0,(IFERROR(MAX(H61-$L53/3630/$L51,0),\"Check Areas!\")),H61),H61)","v":0},null,null,null,null,null,null,0,0,0,43.900000000000055,12.779043280182204]
[null,null,null,null,"Adjusted CN*",{"$f":"IF($L51>0,VLOOKUP(F62,O$23:$S$666,4),0)","v":0},{"$f":"IF($L51>0,VLOOKUP(G62,P$23:$S$666,3),0)","v":0},{"$f":"IF($L51>0,VLOOKUP(H62,Q$23:$S$666,2),0)","v":0},null,null,null,null,null,null,0,0,0,44.000000000000057,12.727272727272698]
[null,null,null,null,"*See Notes above",null,null,null,null,null,null,null,null,null,0,0,0,44.100000000000058,12.675736961451218]
[null,null,"Drainage Area D",null,null,"A Soils","B Soils","C Soils","D Soils",null,"Total Area (acres):",{"$f":"'D.A. D'!F8","v":0},null,null,0,0,0,44.20000000000006,12.624434389140241]
[null,null,"Forest/Open Space -- undisturbed, protected forest/open space or reforested land",null,"Area (acres)",{"$f":"'D.A. D'!B$5","v":0},{"$f":"'D.A. D'!C$5","v":0},{"$f":"'D.A. D'!D$5","v":0},{"$f":"'D.A. D'!E$5","v":0},null,"Runoff Reduction Volume (ft3):",null,null,null,0,0,0,44.300000000000061,12.573363431151211]
[null,null,null,null,"CN",30,55,70,77,null,null,{"$f":"'D.A. D'!F60","v":0},null,null,0,0,0,44.400000000000063,12.52252252252249]
[null,null,"Managed Turf -- disturbed, graded for yards or other turf to be mowed/managed",null,"Area (acres)",{"$f":"'D.A. D'!B$6","v":0},{"$f":"'D.A. D'!C$6","v":0},{"$f":"'D.A. D'!D$6","v":0},{"$f":"'D.A. D'!E$6","v":0},null,null,null,null,null,0,0,0,44.500000000000064,12.471910112359517]
[null,null,null,null,"CN",39,61,74,80,null,null,null,null,null,0,0,0,44.600000000000065,12.421524663677097]
[null,null,"Impervious Cover ",null,"Area (acres)",{"$f":"'D.A. D'!B$7","v":0},{"$f":"'D.A. D'!C$7","v":0},{"$f":"'D.A. D'!D$7","v":0},{"$f":"'D.A. D'!E$7","v":0},null,null,null,null,null,0,0,0,44.700000000000067,12.371364653243816]
[null,null,null,null,"CN",98,98,98,98,null,null,null,null,null,0,0,0,44.800000000000068,12.321428571428537]
[null,null,null,null,null,null,null,null,"CN(D.A. D)",null,null,null,null,null,0,0,0,44.90000000000007,12.271714922048965,null,null,"Drainage Area D:"]
[null,null,null,null,null,null,null,null,{"$f":"ROUND(IF(L65>0,(SUMPRODUCT(F66:I66,F67:I67)+SUMPRODUCT(F68:I68,F69:I69)+SUMPRODUCT(F70:I70,F71:I71))/L65,0),0)","v":0},null,null,null,null,null,0,0,0,45.000000000000071,12.222222222222186]
[null,null,null,null,null,"1-year storm","2-year storm","10-year storm",null,null,null,null,null,null,0,0,0,45.100000000000072,12.172949002217258,null,null,"S (in)"]
[null,null,"RVDeveloped (watershed-inch) with no Runoff Reduction*",null,null,{"$f":"IF(F$6>0.2*($V75),(F$6-0.2*($V75))^2/(F$6+0.8*($V75)),0)","v":0},{"$f":"IF(G$6>0.2*($V75),(G$6-0.2*($V75))^2/(G$6+0.8*($V75)),0)","v":0},{"$f":"IF(H$6>0.2*($V75),(H$6-0.2*($V75))^2/(H$6+0.8*($V75)),0)","v":0},null,null,null,null,null,null,0,0,0,45.200000000000074,12.123893805309699,null,null,{"$f":"IF(I73>0,1000/I73-10,1000)","v":1000}]
[null,null,"RVDeveloped (watershed-inch) with Runoff Reduction*",null,null,{"$f":"IF($L65>0,IF(F75>0,(IFERROR(MAX(F75-$L67/3630/$L65,0),\"Check Areas!\")),F75),F75)","v":0},{"$f":"IF($L65>0,IF(G75>0,(IFERROR(MAX(G75-$L67/3630/$L65,0),\"Check Areas!\")),G75),G75)","v":0},{"$f":"IF($L65>0,IF(H75>0,(IFERROR(MAX(H75-$L67/3630/$L65,0),\"Check Areas!\")),H75),H75)","v":0},null,null,null,null,null,null,0,0,0,45.300000000000075,12.075055187637933]
[null,null,null,null,"Adjusted CN*",{"$f":"IF($L65>0,VLOOKUP(F76,O$23:$S$666,4),0)","v":0},{"$f":"IF($L65>0,VLOOKUP(G76,P$23:$S$666,3),0)","v":0},{"$f":"IF($L65>0,VLOOKUP(H76,Q$23:$S$666,2),0)","v":0},null,null,null,null,null,null,0,0,0,45.400000000000077,12.026431718061637]
[null,null,null,null,"*See Notes above",null,null,null,null,null,null,null,null,null,0,0,0,45.500000000000078,11.978021978021939]
[null,null,"Drainage Area E",null,null,"A Soils","B Soils","C Soils","D Soils",null,"Total Area (acres):",{"$f":"'D.A. E'!F8","v":0},null,null,0,0,0,45.60000000000008,11.929824561403471]
[null,null,"Forest/Open Space -- undisturbed, protected forest/open space or reforested land",null,"Area (acres)",{"$f":"'D.A. E'!B$5","v":0},{"$f":"'D.A. E'!C$5","v":0},{"$f":"'D.A. E'!D$5","v":0},{"$f":"'D.A. E'!E$5","v":0},null,"Runoff Reduction Volume (ft3):",null,null,null,0,0,0,45.700000000000081,11.88183807439821]
[null,null,null,null,"CN",30,55,70,77,null,null,{"$f":"'D.A. E'!F60","v":0},null,null,{"$f":"IF(F$6>0.2*($S81),(F$6-0.2*($S81))^2/(F$6+0.8*($S81)),0)","v":0},0,0,45.800000000000082,11.83406113537114]
[null,null,"Managed Turf -- disturbed, graded for yards or other turf to be mowed/managed",null,"Area (acres)",{"$f":"'D.A. E'!B$6","v":0},{"$f":"'D.A. E'!C$6","v":0},{"$f":"'D.A. E'!D$6","v":0},{"$f":"'D.A. E'!E$6","v":0},null,null,null,null,null,0,0,0,45.900000000000084,11.786492374727629]
[null,null,null,null,"CN",39,61,74,80,null,null,null,null,null,0,0,0,46.000000000000085,11.739130434782567]
[null,null,"Impervious Cover ",null,"Area (acres)",{"$f":"'D.A. E'!B$7","v":0},{"$f":"'D.A. E'!C$7","v":0},{"$f":"'D.A. E'!D$7","v":0},{"$f":"'D.A. E'!E$7","v":0},null,null,null,null,null,0,0,0,46.100000000000087,11.691973969631196]
[null,null,null,null,"CN",98,98,98,98,null,null,null,null,null,0,0,0,46.200000000000088,11.645021645021604]
[null,null,null,null,null,null,null,null,"CN(D.A. E)",null,null,null,null,null,0,0,0,46.30000000000009,11.5982721382289,null,null,"Drainage Area E:"]
[null,null,null,null,null,null,null,null,{"$f":"ROUND(IF(L79>0,(SUMPRODUCT(F80:I80,F81:I81)+SUMPRODUCT(F82:I82,F83:I83)+SUMPRODUCT(F84:I84,F85:I85))/L79,0),0)","v":0},null,null,null,null,null,0,{"$f":"IF(G$6>0.2*($S87),(G$6-0.2*($S87))^2/(G$6+0.8*($S87)),0)","v":0},{"$f":"IF(H$6>0.2*($S87),(H$6-0.2*($S87))^2/(H$6+0.8*($S87)),0)","v":0},46.400000000000091,{"$f":"IF(R87>0,1000/R87-10,1000)","v":11.551724137930993}]
[null,null,null,null,null,"1-year storm","2-year storm","10-year storm",null,null,null,null,null,null,0,0,0,{"$f":"R87+0.1","v":46.500000000000092},11.505376344085978,null,null,"S (in)"]
[null,null,"RVDeveloped (watershed-inch) with no Runoff Reduction*",null,null,{"$f":"IF(F$6>0.2*($V89),(F$6-0.2*($V89))^2/(F$6+0.8*($V89)),0)","v":0},{"$f":"IF(G$6>0.2*($V89),(G$6-0.2*($V89))^2/(G$6+0.8*($V89)),0)","v":0},{"$f":"IF(H$6>0.2*($V89),(H$6-0.2*($V89))^2/(H$6+0.8*($V89)),0)","v":0},null,null,null,null,null,null,0,0,0,46.600000000000094,11.459227467811115,null,null,{"$f":"IF(I87>0,1000/I87-10,1000)","v":1000}]
[null,null,"RVDeveloped (watershed-inch) with Runoff Reduction*",null,null,{"$f":"IF($L79>0,IF(F89>0,(IFERROR(MAX(F89-$L81/3630/$L79,0),\"Check Areas!\")),F89),F89)","v":0},{"$f":"IF($L79>0,IF(G89>0,(IFERROR(MAX(G89-$L81/3630/$L79,0),\"Check Areas!\")),G89),G89)","v":0},{"$f":"IF($L79>0,IF(H89>0,(IFERROR(MAX(H89-$L81/3630/$L79,0),\"Check Areas!\")),H89),H89)","v":0},null,null,null,null,null,null,0,0,0,46.700000000000095,11.413276231263339]
[null,null,null,null,"Adjusted CN*",{"$f":"IF($L79>0,VLOOKUP(F90,O$23:$S$666,4),0)","v":0},{"$f":"IF($L79>0,VLOOKUP(G90,P$23:$S$666,3),0)","v":0},{"$f":"IF($L79>0,VLOOKUP(H90,Q$23:$S$666,2),0)","v":0},null,null,null,null,null,null,0,0,0,46.800000000000097,11.367521367521324]
[null,null,null,null,"*See Notes above",null,null,null,null,null,null,null,null,null,0,0,0,46.900000000000098,11.32196162046904]
[null,null,null,null,null,null,null,null,null,null,null,null,null,null,0,0,0,47.000000000000099,11.276595744680805]
[null,null,".",null,null,null,null,null,null,null,null,null,null,null,0,0,0,47.100000000000101,11.231422505307812]
[null,null,null,null,null,null,null,null,null,null,null,null,null,null,0,0,0,47.200000000000102,11.186440677966054]
[null,null,null,null,null,null,null,null,null,null,null,null,null,null,0,0,0,47.300000000000104,11.141649048625748]
[null,null,null,null,null,null,null,null,null,null,null,null,null,null,0,0,0,47.400000000000105,11.097046413502063]
[null,null,null,null,null,null,null,null,null,null,null,null,null,null,0,0,0,47.500000000000107,11.05263157894732]
[null,null,null,null,null,null,null,null,null,null,null,null,null,null,0,0,0,47.600000000000108,11.008403361344492]
[null,null,null,null,null,null,null,null,null,null,null,null,null,null,0,0,0,47.700000000000109,10.964360587002048]
[null,null,null,null,null,null,null,null,null,null,null,null,null,null,0,0,0,47.800000000000111,10.92050209205016]
[null,null,null,null,null,null,null,null,null,null,null,null,null,null,0,0,0,47.900000000000112,10.876826722338155]
[null,null,null,null,null,null,null,null,null,null,null,null,null,null,0,0,0,48.000000000000114,10.833333333333282]
[null,null,null,null,null,null,null,null,null,null,null,null,null,null,0,0,0,48.100000000000115,10.790020790020741]
[null,null,null,null,null,null,null,null,null,null,null,null,null,null,0,0,0,48.200000000000117,10.74688796680493]
[null,null,null,null,null,null,null,null,null,null,null,null,null,null,0,0,0,48.300000000000118,10.703933747411959]
[null,null,null,null,null,null,null,null,null,null,null,null,null,null,0,0,0,48.400000000000119,10.661157024793336]
[null,null,null,null,null,null,null,null,null,null,null,null,null,null,0,0,0,48.500000000000121,10.618556701030876]
[null,null,null,null,null,null,null,null,null,null,null,null,null,null,0,0,0,48.600000000000122,10.576131687242746]
[null,null,null,null,null,null,null,null,null,null,null,null,null,null,0,0,0,48.700000000000124,10.533880903490708]
[null,null,null,null,null,null,null,null,null,null,null,null,null,null,0,0,0,48.800000000000125,10.491803278688472]
[null,null,null,null,null,null,null,null,null,null,null,null,null,null,0,0,0,48.900000000000126,10.449897750511195]
[null,null,null,null,null,null,null,null,null,null,null,null,null,null,0,0,0,49.000000000000128,10.408163265306069]
[null,null,null,null,null,null,null,null,null,null,null,null,null,null,0,0,0,49.100000000000129,10.366598778004018]
[null,null,null,null,null,null,null,null,null,null,null,null,null,null,0,0,0,49.200000000000131,10.325203252032466]
[]
[]
[]
[]
[]
[]
[]
[]
[]
[]
[]
[]
[]
[]
[]
[]
[]
[]
[]
[]
[]
[]
[]
[]
[]
[]
[]
[]
[]
[]
[]
[]
[]
[]
[]
[]
[]
[]
[]
[]
[]
[]
[]
[null,null,null,null,null,null,null,null,null,null,null,null,null,null,{"$f":"IF(F$6>0.2*($S159),(F$6-0.2*($S159))^2/(F$6+0.8*($S159)),0)","v":0},{"$f":"IF(G$6>0.2*($S159),(G$6-0.2*($S159))^2/(G$6+0.8*($S159)),0)","v":0},{"$f":"IF(H$6>0.2*($S159),(H$6-0.2*($S159))^2/(H$6+0.8*($S159)),0)","v":0},{"$f":"R115+0.1","v":49.300000000000132},{"$f":"IF(R159>0,1000/R159-10,1000)","v":10.283975659229153}]
[null,null,null,null,null,null,null,null,null,null,null,null,null,null,0,0,0,{"$f":"R159+0.1","v":49.400000000000134},10.242914979757032]
[null,null,null,null,null,null,null,null,null,null,null,null,null,null,0,0,0,49.500000000000135,10.202020202020147]
[null,null,null,null,null,null,null,null,null,null,null,null,null,null,0,0,0,49.600000000000136,10.161290322580591]
[null,null,null,null,null,null,null,null,null,null,null,null,null,null,0,0,0,49.700000000000138,10.120724346076404]
[null,null,null,null,null,null,null,null,null,null,null,null,null,null,0,0,0,49.800000000000139,10.080321285140506]
[null,null,null,null,null,null,null,null,null,null,null,null,null,null,0,0,0,49.900000000000141,10.040080160320585]
[null,null,null,null,null,null,null,null,null,null,null,null,null,null,0,0,0,50.000000000000142,9.9999999999999432]
[null,null,null,null,null,null,null,null,null,null,null,null,null,null,0,0,0,50.100000000000144,9.9600798403193025]
[null,null,null,null,null,null,null,null,null,null,null,null,null,null,0,0,0,50.200000000000145,9.9203187250995448]
[null,null,null,null,null,null,null,null,null,null,null,null,null,null,0,0,0,50.300000000000146,9.8807157057653505]
[null,null,null,null,null,null,null,null,null,null,null,null,null,null,0,0,0,50.400000000000148,9.8412698412697814]
[null,null,null,null,null,null,null,null,null,null,null,null,null,null,0,0,0,50.500000000000149,9.801980198019745]
[null,null,null,null,null,null,null,null,null,null,null,null,null,null,0,0,0,50.600000000000151,9.7628458498023143]
[null,null,null,null,null,null,null,null,null,null,null,null,null,null,0,0,0,50.700000000000152,9.7238658777119724]
[null,null,null,null,null,null,null,null,null,null,null,null,null,null,0,0,0,50.800000000000153,9.6850393700786803]
[null,null,null,null,null,null,null,null,null,null,null,null,null,null,0,0,0,50.900000000000155,9.6463654223967978]
[null,null,null,null,null,null,null,null,null,null,null,null,null,null,0,0,0,51.000000000000156,9.607843137254843]
[null,null,null,null,null,null,null,null,null,null,null,null,null,null,0,0,0,51.100000000000158,9.569471624266086]
[null,null,null,null,null,null,null,null,null,null,null,null,null,null,0,0,0,51.200000000000159,9.5312499999999396]
[null,null,null,null,null,null,null,null,null,null,null,null,null,null,0,0,0,51.300000000000161,9.4931773879141694]
[null,null,null,null,null,null,null,null,null,null,null,null,null,null,0,0,0,51.400000000000162,9.4552529182878757]
[null,null,null,null,null,null,null,null,null,null,null,null,null,null,0,0,0,51.500000000000163,9.4174757281552779]
[null,null,null,null,null,null,null,null,null,null,null,null,null,null,0,0,0,51.600000000000165,9.3798449612402486]
[null,null,null,null,null,null,null,null,null,null,null,null,null,null,0,0,0,51.700000000000166,9.3423597678916188]
[null,null,null,null,null,null,null,null,null,null,null,null,null,null,0,0,0,51.800000000000168,9.3050193050192433]
[null,null,null,null,null,null,null,null,null,null,null,null,null,null,0,0,0,51.900000000000169,9.2678227360307659]
[null,null,null,null,null,null,null,null,null,null,null,null,null,null,0,0,0,52.000000000000171,9.230769230769166]
[null,null,null,null,null,null,null,null,null,null,null,null,null,null,0,0,0,52.100000000000172,9.1938579654509915]
[null,null,null,null,null,null,null,null,null,null,null,null,null,null,0,0,0,52.200000000000173,9.1570881226053018]
[null,null,null,null,null,null,null,null,null,null,null,null,null,null,0,0,0,52.300000000000175,9.1204588910133211]
[null,null,null,null,null,null,null,null,null,null,null,null,null,null,0,0,0,52.400000000000176,9.0839694656487922]
[null,null,null,null,null,null,null,null,null,null,null,null,null,null,0,0,0,52.500000000000178,9.0476190476189835]
[null,null,null,null,null,null,null,null,null,null,null,null,null,null,0,0,0,52.600000000000179,9.0114068441063999]
[null,null,null,null,null,null,null,null,null,null,null,null,null,null,0,0,0,52.70000000000018,8.9753320683111291]
[null,null,null,null,null,null,null,null,null,null,null,null,null,null,0,0,0,52.800000000000182,8.9393939393938737]
[null,null,null,null,null,null,null,null,null,null,null,null,null,null,0,0,0,52.900000000000183,8.9035916824195951]
[null,null,null,null,null,null,null,null,null,null,null,null,null,null,0,0,0,53.000000000000185,8.8679245283018204]
[null,null,null,null,null,null,null,null,null,null,null,null,null,null,0,0,0,53.100000000000186,8.8323917137475796]
[null,null,null,null,null,null,null,null,null,null,null,null,null,null,0,0,0,53.200000000000188,8.7969924812029419]
[null,null,null,null,null,null,null,null,null,null,null,null,null,null,0,0,0,53.300000000000189,8.7617260787991817]
[null,null,null,null,null,null,null,null,null,null,null,null,null,null,0,0,0,53.40000000000019,8.7265917602995593]
[null,null,null,null,null,null,null,null,null,null,null,null,null,null,0,0,0,53.500000000000192,8.6915887850466618]
[null,null,null,null,null,null,null,null,null,null,null,null,null,null,0,0,0,53.600000000000193,8.6567164179103813]
[null,null,null,null,null,null,null,null,null,null,null,null,null,null,0,0,0,53.700000000000195,8.6219739292364324]
[null,null,null,null,null,null,null,null,null,null,null,null,null,null,0,0,0,53.800000000000196,8.5873605947954701]
[null,null,null,null,null,null,null,null,null,null,null,null,null,null,0,0,0,53.900000000000198,8.5528756957327694]
[null,null,null,null,null,null,null,null,null,null,null,null,null,null,0,0,0,54.000000000000199,8.5185185185184515]
[null,null,null,null,null,null,null,null,null,null,null,null,null,null,0,0,0,54.1000000000002,8.4842883548982684]
[null,null,null,null,null,null,null,null,null,null,null,null,null,null,0,0,0,54.200000000000202,8.4501845018449515]
[null,null,null,null,null,null,null,null,null,null,null,null,null,null,0,0,0,54.300000000000203,8.4162062615100588]
[null,null,null,null,null,null,null,null,null,null,null,null,null,null,0,0,0,54.400000000000205,8.3823529411764]
[null,null,null,null,null,null,null,null,null,null,null,null,null,null,0,0,0,54.500000000000206,8.3486238532109383]
[null,null,null,null,null,null,null,null,null,null,null,null,null,null,0,0,0,54.600000000000207,8.3150183150182464]
[null,null,null,null,null,null,null,null,null,null,null,null,null,null,0,0,0,54.700000000000209,8.2815356489944456]
[null,null,null,null,null,null,null,null,null,null,null,null,null,null,0,0,0,54.80000000000021,8.2481751824816811]
[null,null,null,null,null,null,null,null,null,null,null,null,null,null,0,0,0,54.900000000000212,8.2149362477230632]
[null,null,null,null,null,null,null,null,null,null,null,null,null,null,0,0,0,55.000000000000213,8.1818181818181124]
[null,null,null,null,null,null,null,null,null,null,null,null,null,null,0,0,0,55.100000000000215,8.1488203266786954]
[null,null,null,null,null,null,null,null,null,null,null,null,null,null,0,0,0,55.200000000000216,8.1159420289854367]
[null,null,null,null,null,null,null,null,null,null,null,null,null,null,0,0,0,55.300000000000217,8.0831826401445959]
[null,null,null,null,null,null,null,null,null,null,null,null,null,null,0,0,0,55.400000000000219,8.050541516245417]
[null,null,null,null,null,null,null,null,null,null,null,null,null,null,0,0,0,55.50000000000022,8.0180180180179477]
[null,null,null,null,null,null,null,null,null,null,null,null,null,null,0,0,0,55.600000000000222,7.9856115107912942]
[null,null,null,null,null,null,null,null,null,null,null,null,null,null,{"$f":"IF(F$6>0.2*($S223),(F$6-0.2*($S223))^2/(F$6+0.8*($S223)),0)","v":0},{"$f":"IF(G$6>0.2*($S223),(G$6-0.2*($S223))^2/(G$6+0.8*($S223)),0)","v":0},{"$f":"IF(H$6>0.2*($S223),(H$6-0.2*($S223))^2/(H$6+0.8*($S223)),0)","v":0},55.700000000000223,{"$f":"IF(R223>0,1000/R223-10,1000)","v":7.9533213644523535}]
[null,null,null,null,null,null,null,null,null,null,null,null,null,null,0,0,0,{"$f":"R223+0.1","v":55.800000000000225},7.9211469534049463]
[null,null,null,null,null,null,null,null,null,null,null,null,null,null,0,0,0,55.900000000000226,7.8890876565294441]
[null,null,null,null,null,null,null,null,null,null,null,null,null,null,0,0,0,56.000000000000227,7.857142857142783]
[null,null,null,null,null,null,null,null,null,null,null,null,null,null,0,0,0,56.100000000000229,7.8253119429589297]
[null,null,null,null,null,null,null,null,null,null,null,null,null,null,0,0,0,56.20000000000023,7.7935943060497479]
[null,null,null,null,null,null,null,null,null,null,null,null,null,null,0,0,0,56.300000000000232,7.76198934280632]
[null,null,null,null,null,null,null,null,null,null,null,null,null,null,0,0,0,56.400000000000233,7.7304964539006349]
[null,null,null,null,null,null,null,null,null,null,null,null,null,null,0,0,0,56.500000000000234,7.6991150442477156]
[null,null,null,null,null,null,null,null,null,null,null,null,null,null,0,0,0,56.600000000000236,7.6678445229681245]
[null,null,null,null,null,null,null,null,null,null,null,null,null,null,0,0,0,56.700000000000237,7.6366843033508971]
[null,null,null,null,null,null,null,null,null,null,null,null,null,null,0,0,0,56.800000000000239,7.6056338028168291]
[null,null,null,null,null,null,null,null,null,null,null,null,null,null,0,0,0,56.90000000000024,7.5746924428821742]
[null,null,null,null,null,null,null,null,null,null,null,null,null,null,0,0,0,57.000000000000242,7.5438596491227337]
[null,null,null,null,null,null,null,null,null,null,null,null,null,null,0,0,0,57.100000000000243,7.5131348511382789]
[null,null,null,null,null,null,null,null,null,null,null,null,null,null,0,0,0,57.200000000000244,7.4825174825174088]
[null,null,null,null,null,null,null,null,null,null,null,null,null,null,0,0,0,57.300000000000246,7.4520069808027181]
[null,null,null,null,null,null,null,null,null,null,null,null,null,null,0,0,0,57.400000000000247,7.4216027874563721]
[null,null,null,null,null,null,null,null,null,null,null,null,null,null,0,0,0,57.500000000000249,7.3913043478260114]
[null,null,null,null,null,null,null,null,null,null,null,null,null,null,0,0,0,57.60000000000025,7.3611111111110361]
[null,null,null,null,null,null,null,null,null,null,null,null,null,null,0,0,0,57.700000000000252,7.3310225303292142]
[null,null,null,null,null,null,null,null,null,null,null,null,null,null,0,0,0,57.800000000000253,7.3010380622836628]
[null,null,null,null,null,null,null,null,null,null,null,null,null,null,0,0,0,57.900000000000254,7.2711571675301485]
[null,null,null,null,null,null,null,null,null,null,null,null,null,null,0,0,0,58.000000000000256,7.241379310344751]
[null,null,null,null,null,null,null,null,null,null,null,null,null,null,0,0,0,58.100000000000257,7.2117039586918352]
[null,null,null,null,null,null,null,null,null,null,null,null,null,null,0,0,0,58.200000000000259,7.1821305841923646]
[null,null,null,null,null,null,null,null,null,null,null,null,null,null,0,0,0,58.30000000000026,7.1526586620925485]
[null,null,null,null,null,null,null,null,null,null,null,null,null,null,0,0,0,58.400000000000261,7.1232876712327986]
[null,null,null,null,null,null,null,null,null,null,null,null,null,null,0,0,0,58.500000000000263,7.0940170940170155]
[null,null,null,null,null,null,null,null,null,null,null,null,null,null,0,0,0,58.600000000000264,7.0648464163821743]
[null,null,null,null,null,null,null,null,null,null,null,null,null,null,0,0,0,58.700000000000266,7.0357751277682361]
[null,null,null,null,null,null,null,null,null,null,null,null,null,null,0,0,0,58.800000000000267,7.0068027210883592]
[null,null,null,null,null,null,null,null,null,null,null,null,null,null,0,0,0,58.900000000000269,6.9779286926994146]
[null,null,null,null,null,null,null,null,null,null,null,null,null,null,0,0,0,59.00000000000027,6.9491525423728042]
[null,null,null,null,null,null,null,null,null,null,null,null,null,null,0,0,0,59.100000000000271,6.9204737732655737]
[null,null,null,null,null,null,null,null,null,null,null,null,null,null,0,0,0,59.200000000000273,6.8918918918918131]
[null,null,null,null,null,null,null,null,null,null,null,null,null,null,0,0,0,59.300000000000274,6.863406408094356]
[null,null,null,null,null,null,null,null,null,null,null,null,null,null,0,0,0,59.400000000000276,6.8350168350167557]
[null,null,null,null,null,null,null,null,null,null,null,null,null,null,0,0,0,59.500000000000277,6.8067226890755528]
[null,null,null,null,null,null,null,null,null,null,null,null,null,null,0,0,0,59.600000000000279,6.7785234899328088]
[null,null,null,null,null,null,null,null,null,null,null,null,null,null,0,0,0,59.70000000000028,6.7504187604689321]
[null,null,null,null,null,null,null,null,null,null,null,null,null,null,0,0,0,59.800000000000281,6.7224080267557724]
[null,null,null,null,null,null,null,null,null,null,null,null,null,null,0,0,0,59.900000000000283,6.6944908180299727]
[null,null,null,null,null,null,null,null,null,null,null,null,null,null,0,0,0,60.000000000000284,6.6666666666665861]
[null,null,null,null,null,null,null,null,null,null,null,null,null,null,0,0,0,60.100000000000286,6.6389351081529995]
[null,null,null,null,null,null,null,null,null,null,null,null,null,null,0,0,0,60.200000000000287,6.6112956810630443]
[null,null,null,null,null,null,null,null,null,null,null,null,null,null,0,0,0,60.300000000000288,6.5837479270314283]
[null,null,null,null,null,null,null,null,null,null,null,null,null,null,0,0,0,60.40000000000029,6.5562913907283971]
[null,null,null,null,null,null,null,null,null,null,null,null,null,null,0,0,0,60.500000000000291,6.5289256198346308]
[null,null,null,null,null,null,null,null,null,null,null,null,null,null,0,0,0,60.600000000000293,6.5016501650164216]
[null,null,null,null,null,null,null,null,null,null,null,null,null,null,0,0,0,60.700000000000294,6.474464579901074]
[null,null,null,null,null,null,null,null,null,null,null,null,null,null,0,0,0,60.800000000000296,6.4473684210525519]
[null,null,null,null,null,null,null,null,null,null,null,null,null,null,0,0,0,60.900000000000297,6.4203612479473762]
[null,null,null,null,null,null,null,null,null,null,null,null,null,null,0,0,0,61.000000000000298,6.3934426229507402]
[null,null,null,null,null,null,null,null,null,null,null,null,null,null,0,0,0,61.1000000000003,6.3666121112928806]
[null,null,null,null,null,null,null,null,null,null,null,null,null,null,0,0,0,61.200000000000301,6.3398692810456723]
[null,null,null,null,null,null,null,null,null,null,null,null,null,null,0,0,0,61.300000000000303,6.3132137030994286]
[null,null,null,null,null,null,null,null,null,null,null,null,null,null,0,0,0,61.400000000000304,6.2866449511399836]
[null,null,null,null,null,null,null,null,null,null,null,null,null,null,0,0,0,61.500000000000306,6.260162601625936]
[null,null,null,null,null,null,null,null,null,null,null,null,null,null,0,0,0,61.600000000000307,6.2337662337661541]
[null,null,null,null,null,null,null,null,null,null,null,null,null,null,0,0,0,61.700000000000308,6.2074554294974895]
[null,null,null,null,null,null,null,null,null,null,null,null,null,null,0,0,0,61.80000000000031,6.1812297734627037]
[null,null,null,null,null,null,null,null,null,null,null,null,null,null,0,0,0,61.900000000000311,6.1550888529886087]
[null,null,null,null,null,null,null,null,null,null,null,null,null,null,0,0,0,62.000000000000313,6.1290322580644343]
[null,null,null,null,null,null,null,null,null,null,null,null,null,null,{"$f":"IF(F$6>0.2*($S287),(F$6-0.2*($S287))^2/(F$6+0.8*($S287)),0)","v":0},{"$f":"IF(G$6>0.2*($S287),(G$6-0.2*($S287))^2/(G$6+0.8*($S287)),0)","v":0},{"$f":"IF(H$6>0.2*($S287),(H$6-0.2*($S287))^2/(H$6+0.8*($S287)),0)","v":0},62.100000000000314,{"$f":"IF(R287>0,1000/R287-10,1000)","v":6.1030595813203696}]
[null,null,null,null,null,null,null,null,null,null,null,null,null,null,0,0,0,{"$f":"R287+0.1","v":62.200000000000315},6.0771704180063502]
[null,null,null,null,null,null,null,null,null,null,null,null,null,null,0,0,0,62.300000000000317,6.0513643659710254]
[null,null,null,null,null,null,null,null,null,null,null,null,null,null,0,0,0,62.400000000000318,6.0256410256409438]
[null,null,null,null,null,null,null,null,null,null,null,null,null,null,0,0,0,62.50000000000032,5.9999999999999183]
[null,null,null,null,null,null,null,null,null,null,null,null,null,null,0,0,0,62.600000000000321,5.9744408945686089]
[null,null,null,null,null,null,null,null,null,null,null,null,null,null,0,0,0,62.700000000000323,5.9489633173842886]
[null,null,null,null,null,null,null,null,null,null,null,null,null,null,0,0,0,62.800000000000324,5.9235668789808091]
[null,null,null,null,null,null,null,null,null,null,null,null,null,null,0,0,0,62.900000000000325,5.8982511923687575]
[null,null,null,null,null,null,null,null,null,null,null,null,null,null,0,0,0,63.000000000000327,5.87301587301579]
[null,null,null,null,null,null,null,null,null,null,null,null,null,null,0,0,0,63.100000000000328,5.8478605388271756]
[null,null,null,null,null,null,null,null,null,null,null,null,null,null,0,0,0,63.20000000000033,5.8227848101264996]
[null,null,null,null,null,null,null,null,null,null,null,null,null,null,0,0,0,63.300000000000331,5.7977883096365677]
[null,null,null,null,null,null,null,null,null,null,null,null,null,null,0,0,0,63.400000000000333,5.7728706624604857]
[null,null,null,null,null,null,null,null,null,null,null,null,null,null,0,0,0,63.500000000000334,5.7480314960629091]
[null,null,null,null,null,null,null,null,null,null,null,null,null,null,0,0,0,63.600000000000335,5.7232704402514898]
[null,null,null,null,null,null,null,null,null,null,null,null,null,null,0,0,0,63.700000000000337,5.698587127158472]
[null,null,null,null,null,null,null,null,null,null,null,null,null,null,0,0,0,63.800000000000338,5.673981191222488]
[null,null,null,null,null,null,null,null,null,null,null,null,null,null,0,0,0,63.90000000000034,5.6494522691704958]
[null,null,null,null,null,null,null,null,null,null,null,null,null,null,0,0,0,64.000000000000341,5.6249999999999165]
[null,null,null,null,null,null,null,null,null,null,null,null,null,null,0,0,0,64.100000000000335,5.6006240249609167]
[null,null,null,null,null,null,null,null,null,null,null,null,null,null,0,0,0,64.20000000000033,5.5763239875388599]
[null,null,null,null,null,null,null,null,null,null,null,null,null,null,0,0,0,64.300000000000324,5.5520995334369356]
[null,null,null,null,null,null,null,null,null,null,null,null,null,null,0,0,0,64.400000000000318,5.5279503105589303]
[null,null,null,null,null,null,null,null,null,null,null,null,null,null,0,0,0,64.500000000000313,5.5038759689921726]
[null,null,null,null,null,null,null,null,null,null,null,null,null,null,0,0,0,64.600000000000307,5.4798761609906386]
[null,null,null,null,null,null,null,null,null,null,null,null,null,null,0,0,0,64.700000000000301,5.455950540958197]
[null,null,null,null,null,null,null,null,null,null,null,null,null,null,0,0,0,64.800000000000296,5.4320987654320287]
[null,null,null,null,null,null,null,null,null,null,null,null,null,null,0,0,0,64.90000000000029,5.4083204930661868]
[null,null,null,null,null,null,null,null,null,null,null,null,null,null,0,0,0,65.000000000000284,5.3846153846153175]
[null,null,null,null,null,null,null,null,null,null,null,null,null,null,0,0,0,65.100000000000279,5.3609831029185209]
[null,null,null,null,null,null,null,null,null,null,null,null,null,null,0,0,0,65.200000000000273,5.3374233128833719]
[null,null,null,null,null,null,null,null,null,null,null,null,null,null,0,0,0,65.300000000000267,5.3139356814700758]
[null,null,null,null,null,null,null,null,null,null,null,null,null,null,0,0,0,65.400000000000261,5.2905198776757807]
[null,null,null,null,null,null,null,null,null,null,null,null,null,null,0,0,0,65.500000000000256,5.2671755725190241]
[null,null,null,null,null,null,null,null,null,null,null,null,null,null,0,0,0,65.60000000000025,5.2439024390243318]
[null,null,null,null,null,null,null,null,null,null,null,null,null,null,0,0,0,65.700000000000244,5.2207001522069447]
[null,null,null,null,null,null,null,null,null,null,null,null,null,null,0,0,0,65.800000000000239,5.1975683890576949]
[null,null,null,null,null,null,null,null,null,null,null,null,null,null,0,0,0,65.900000000000233,5.1745068285280187]
[null,null,null,null,null,null,null,null,null,null,null,null,null,null,0,0,0,66.000000000000227,5.151515151515099]
[null,null,null,null,null,null,null,null,null,null,null,null,null,null,0,0,0,66.100000000000222,5.1285930408471501]
[null,null,null,null,null,null,null,null,null,null,null,null,null,null,0,0,0,66.200000000000216,5.1057401812688337]
[null,null,null,null,null,null,null,null,null,null,null,null,null,null,0,0,0,66.30000000000021,5.0829562594267994]
[null,null,null,null,null,null,null,null,null,null,null,null,null,null,0,0,0,66.400000000000205,5.0602409638553745]
[null,null,null,null,null,null,null,null,null,null,null,null,null,null,0,0,0,66.500000000000199,5.0375939849623617]
[null,null,null,null,null,null,null,null,null,null,null,null,null,null,0,0,0,66.600000000000193,5.0150150150149706]
[null,null,null,null,null,null,null,null,null,null,null,null,null,null,0,0,0,66.700000000000188,4.9925037481258947]
[null,null,null,null,null,null,null,null,null,null,null,null,null,null,0,0,0,66.800000000000182,4.9700598802394804]
[null,null,null,null,null,null,null,null,null,null,null,null,null,null,0,0,0,66.900000000000176,4.9476831091180475]
[null,null,null,null,null,null,null,null,null,null,null,null,null,null,0,0,0,67.000000000000171,4.9253731343283196]
[null,null,null,null,null,null,null,null,null,null,null,null,null,null,0,0,0,67.100000000000165,4.9031296572279821]
[null,null,null,null,null,null,null,null,null,null,null,null,null,null,0,0,0,67.200000000000159,4.8809523809523458]
[null,null,null,null,null,null,null,null,null,null,null,null,null,null,0,0,0,67.300000000000153,4.8588410104011555]
[null,null,null,null,null,null,null,null,null,null,null,null,null,null,0,0,0,67.400000000000148,4.8367952522254871]
[null,null,null,null,null,null,null,null,null,null,null,null,null,null,0,0,0,67.500000000000142,4.8148148148147829]
[null,null,null,null,null,null,null,null,null,null,null,null,null,null,0,0,0,67.600000000000136,4.7928994082839935]
[null,null,null,null,null,null,null,null,null,null,null,null,null,null,0,0,0,67.700000000000131,4.7710487444608276]
[null,null,null,null,null,null,null,null,null,null,null,null,null,null,0,0,0,67.800000000000125,4.7492625368731289]
[null,null,null,null,null,null,null,null,null,null,null,null,null,null,0,0,0,67.900000000000119,4.7275405007363513]
[null,null,null,null,null,null,null,null,null,null,null,null,null,null,0,0,0,68.000000000000114,4.7058823529411526]
[null,null,null,null,null,null,null,null,null,null,null,null,null,null,0,0,0,68.100000000000108,4.6842878120410933]
[null,null,null,null,null,null,null,null,null,null,null,null,null,null,0,0,0,68.200000000000102,4.6627565982404473]
[null,null,null,null,null,null,null,null,null,null,null,null,null,null,0,0,0,68.300000000000097,4.6412884333821172]
[null,null,null,null,null,null,null,null,null,null,null,null,null,null,0,0,0,68.400000000000091,4.6198830409356528]
[null,null,null,null,null,null,null,null,null,null,null,null,null,null,{"$f":"IF(F$6>0.2*($S351),(F$6-0.2*($S351))^2/(F$6+0.8*($S351)),0)","v":0},{"$f":"IF(G$6>0.2*($S351),(G$6-0.2*($S351))^2/(G$6+0.8*($S351)),0)","v":0},{"$f":"IF(H$6>0.2*($S351),(H$6-0.2*($S351))^2/(H$6+0.8*($S351)),0)","v":0},68.500000000000085,{"$f":"IF(R351>0,1000/R351-10,1000)","v":4.5985401459853836}]
[null,null,null,null,null,null,null,null,null,null,null,null,null,null,0,0,0,{"$f":"R351+0.1","v":68.60000000000008},4.5772594752186428]
[null,null,null,null,null,null,null,null,null,null,null,null,null,null,0,0,0,68.700000000000074,4.5560407569141042]
[null,null,null,null,null,null,null,null,null,null,null,null,null,null,0,0,0,68.800000000000068,4.5348837209302175]
[null,null,null,null,null,null,null,null,null,null,null,null,null,null,0,0,0,68.900000000000063,4.5137880986937464]
[null,null,null,null,null,null,null,null,null,null,null,null,null,null,0,0,0,69.000000000000057,4.4927536231883938]
[null,null,null,null,null,null,null,null,null,null,null,null,null,null,0,0,0,69.100000000000051,4.4717800289435488]
[null,null,null,null,null,null,null,null,null,null,null,null,null,null,0,0,0,69.200000000000045,4.4508670520231117]
[null,null,null,null,null,null,null,null,null,null,null,null,null,null,0,0,0,69.30000000000004,4.4300144300144222]
[null,null,null,null,null,null,null,null,null,null,null,null,null,null,0,0,0,69.400000000000034,4.4092219020172845]
[null,null,null,null,null,null,null,null,null,null,null,null,null,null,0,0,0,69.500000000000028,4.3884892086330876]
[null,null,null,null,null,null,null,null,null,null,null,null,null,null,0,0,0,69.600000000000023,4.367816091954019]
[null,null,null,null,null,null,null,null,null,null,null,null,null,null,0,0,0,69.700000000000017,4.3472022955523641]
[null,null,null,null,null,null,null,null,null,null,null,null,null,null,0,0,0,69.800000000000011,4.3266475644699121]
[null,null,null,null,null,null,null,null,null,null,null,null,null,null,0,0,0,69.900000000000006,4.3061516452074375]
[null,null,null,null,null,null,null,null,null,null,null,null,null,null,0,0,0,70,4.2857142857142865]
[null,null,null,null,null,null,null,null,null,null,null,null,null,null,0,0,0,70.099999999999994,4.2653352353780321]
[null,null,null,null,null,null,null,null,null,null,null,null,null,null,0,0,0,70.199999999999989,4.2450142450142465]
[null,null,null,null,null,null,null,null,null,null,null,null,null,null,0,0,0,70.299999999999983,4.2247510668563333]
[null,null,null,null,null,null,null,null,null,null,null,null,null,null,0,0,0,70.399999999999977,4.2045454545454586]
[null,null,null,null,null,null,null,null,null,null,null,null,null,null,0,0,0,70.499999999999972,4.1843971631205736]
[null,null,null,null,null,null,null,null,null,null,null,null,null,null,0,0,0,70.599999999999966,4.1643059490085061]
[null,null,null,null,null,null,null,null,null,null,null,null,null,null,0,0,0,70.69999999999996,4.144271570014153]
[null,null,null,null,null,null,null,null,null,null,null,null,null,null,0,0,0,70.799999999999955,4.1242937853107442]
[null,null,null,null,null,null,null,null,null,null,null,null,null,null,0,0,0,70.899999999999949,4.1043723554301934]
[null,null,null,null,null,null,null,null,null,null,null,null,null,null,0,0,0,70.999999999999943,4.0845070422535326]
[null,null,null,null,null,null,null,null,null,null,null,null,null,null,0,0,0,71.099999999999937,4.0646976090014189]
[null,null,null,null,null,null,null,null,null,null,null,null,null,null,0,0,0,71.199999999999932,4.0449438202247325]
[null,null,null,null,null,null,null,null,null,null,null,null,null,null,0,0,0,71.299999999999926,4.0252454417952457]
[null,null,null,null,null,null,null,null,null,null,null,null,null,null,0,0,0,71.39999999999992,4.0056022408963745]
[null,null,null,null,null,null,null,null,null,null,null,null,null,null,0,0,0,71.499999999999915,3.9860139860140027]
[null,null,null,null,null,null,null,null,null,null,null,null,null,null,0,0,0,71.599999999999909,3.9664804469273918]
[null,null,null,null,null,null,null,null,null,null,null,null,null,null,0,0,0,71.699999999999903,3.947001394700159]
[null,null,null,null,null,null,null,null,null,null,null,null,null,null,0,0,0,71.799999999999898,3.9275766016713298]
[null,null,null,null,null,null,null,null,null,null,null,null,null,null,0,0,0,71.899999999999892,3.908205841446474]
[null,null,null,null,null,null,null,null,null,null,null,null,null,null,0,0,0,71.999999999999886,3.8888888888889106]
[null,null,null,null,null,null,null,null,null,null,null,null,null,null,0,0,0,72.099999999999881,3.8696255201109793]
[null,null,null,null,null,null,null,null,null,null,null,null,null,null,0,0,0,72.199999999999875,3.850415512465398]
[null,null,null,null,null,null,null,null,null,null,null,null,null,null,0,0,0,72.299999999999869,3.8312586445366783]
[null,null,null,null,null,null,null,null,null,null,null,null,null,null,0,0,0,72.399999999999864,3.8121546961326231]
[null,null,null,null,null,null,null,null,null,null,null,null,null,null,0,0,0,72.499999999999858,3.7931034482758896]
[null,null,null,null,null,null,null,null,null,null,null,null,null,null,0,0,0,72.599999999999852,3.7741046831956204]
[null,null,null,null,null,null,null,null,null,null,null,null,null,null,0,0,0,72.699999999999847,3.7551581843191482]
[null,null,null,null,null,null,null,null,null,null,null,null,null,null,0,0,0,72.799999999999841,3.7362637362637656]
[null,null,null,null,null,null,null,null,null,null,null,null,null,null,0,0,0,72.899999999999835,3.7174211248285634]
[null,null,null,null,null,null,null,null,null,null,null,null,null,null,0,0,0,72.999999999999829,3.698630136986333]
[null,null,null,null,null,null,null,null,null,null,null,null,null,null,0,0,0,73.099999999999824,3.6798905608755454]
[null,null,null,null,null,null,null,null,null,null,null,null,null,null,0,0,0,73.199999999999818,3.6612021857923835]
[null,null,null,null,null,null,null,null,null,null,null,null,null,null,0,0,0,73.299999999999812,3.6425648021828447]
[null,null,null,null,null,null,null,null,null,null,null,null,null,null,0,0,0,73.399999999999807,3.6239782016349125]
[null,null,null,null,null,null,null,null,null,null,null,null,null,null,0,0,0,73.499999999999801,3.6054421768707847]
[null,null,null,null,null,null,null,null,null,null,null,null,null,null,0,0,0,73.599999999999795,3.5869565217391681]
[null,null,null,null,null,null,null,null,null,null,null,null,null,null,0,0,0,73.69999999999979,3.5685210312076379]
[null,null,null,null,null,null,null,null,null,null,null,null,null,null,0,0,0,73.799999999999784,3.5501355013550526]
[null,null,null,null,null,null,null,null,null,null,null,null,null,null,0,0,0,73.899999999999778,3.531799729364046]
[null,null,null,null,null,null,null,null,null,null,null,null,null,null,0,0,0,73.999999999999773,3.5135135135135549]
[null,null,null,null,null,null,null,null,null,null,null,null,null,null,0,0,0,74.099999999999767,3.4952766531714321]
[null,null,null,null,null,null,null,null,null,null,null,null,null,null,0,0,0,74.199999999999761,3.4770889487871059]
[null,null,null,null,null,null,null,null,null,null,null,null,null,null,0,0,0,74.299999999999756,3.4589502018842975]
[null,null,null,null,null,null,null,null,null,null,null,null,null,null,0,0,0,74.39999999999975,3.4408602150538083]
[null,null,null,null,null,null,null,null,null,null,null,null,null,null,0,0,0,74.499999999999744,3.4228187919463551]
[null,null,null,null,null,null,null,null,null,null,null,null,null,null,0,0,0,74.599999999999739,3.4048257372654618]
[null,null,null,null,null,null,null,null,null,null,null,null,null,null,0,0,0,74.699999999999733,3.3868808567604223]
[null,null,null,null,null,null,null,null,null,null,null,null,null,null,0,0,0,74.799999999999727,3.3689839572192994]
[null,null,null,null,null,null,null,null,null,null,null,null,null,null,{"$f":"IF(F$6>0.2*($S415),(F$6-0.2*($S415))^2/(F$6+0.8*($S415)),0)","v":0},{"$f":"IF(G$6>0.2*($S415),(G$6-0.2*($S415))^2/(G$6+0.8*($S415)),0)","v":0},{"$f":"IF(H$6>0.2*($S415),(H$6-0.2*($S415))^2/(H$6+0.8*($S415)),0)","v":0},74.899999999999721,{"$f":"IF(R415>0,1000/R415-10,1000)","v":3.3511348464619992}]
[null,null,null,null,null,null,null,null,null,null,null,null,null,null,0,0,0,{"$f":"R415+0.1","v":74.999999999999716},3.3333333333333837]
[null,null,null,null,null,null,null,null,null,null,null,null,null,null,0,0,0,75.09999999999971,3.3155792276964569]
[null,null,null,null,null,null,null,null,null,null,null,null,null,null,0,0,0,75.199999999999704,3.2978723404255845]
[null,null,null,null,null,null,null,null,null,null,null,null,null,null,0,0,0,75.299999999999699,3.2802124833997883]
[null,null,null,null,null,null,null,null,null,null,null,null,null,null,0,0,0,75.399999999999693,3.2625994694960756]
[null,null,null,null,null,null,null,null,null,null,null,null,null,null,0,0,0,75.499999999999687,3.2450331125828367]
[null,null,null,null,null,null,null,null,null,null,null,null,null,null,0,0,0,75.599999999999682,3.227513227513283]
[null,null,null,null,null,null,null,null,null,null,null,null,null,null,0,0,0,75.699999999999676,3.2100396301189473]
[null,null,null,null,null,null,null,null,null,null,null,null,null,null,0,0,0,75.79999999999967,3.1926121372032235]
[null,null,null,null,null,null,null,null,null,null,null,null,null,null,0,0,0,75.899999999999665,3.1752305665349727]
[null,null,null,null,null,null,null,null,null,null,null,null,null,null,0,0,0,75.999999999999659,3.1578947368421648]
[null,null,null,null,null,null,null,null,null,null,null,null,null,null,0,0,0,76.099999999999653,3.1406044678055789]
[null,null,null,null,null,null,null,null,null,null,null,null,null,null,0,0,0,76.199999999999648,3.1233595800525542]
[null,null,null,null,null,null,null,null,null,null,null,null,null,null,0,0,0,76.299999999999642,3.1061598951507818]
[null,null,null,null,null,null,null,null,null,null,null,null,null,null,0,0,0,76.399999999999636,3.0890052356021567]
[null,null,null,null,null,null,null,null,null,null,null,null,null,null,0,0,0,76.499999999999631,3.071895424836665]
[null,null,null,null,null,null,null,null,null,null,null,null,null,null,0,0,0,76.599999999999625,3.0548302872063307]
[null,null,null,null,null,null,null,null,null,null,null,null,null,null,0,0,0,76.699999999999619,3.0378096479792038]
[null,null,null,null,null,null,null,null,null,null,null,null,null,null,0,0,0,76.799999999999613,3.0208333333333997]
[null,null,null,null,null,null,null,null,null,null,null,null,null,null,0,0,0,76.899999999999608,3.0039011703511722]
[null,null,null,null,null,null,null,null,null,null,null,null,null,null,0,0,0,76.999999999999602,2.9870129870130544]
[null,null,null,null,null,null,null,null,null,null,null,null,null,null,0,0,0,77.099999999999596,2.9701686121920261]
[null,null,null,null,null,null,null,null,null,null,null,null,null,null,0,0,0,77.199999999999591,2.9533678756477375]
[null,null,null,null,null,null,null,null,null,null,null,null,null,null,0,0,0,77.299999999999585,2.9366106080207679]
[null,null,null,null,null,null,null,null,null,null,null,null,null,null,0,0,0,77.399999999999579,2.9198966408269431]
[null,null,null,null,null,null,null,null,null,null,null,null,null,null,0,0,0,77.499999999999574,2.9032258064516832]
[null,null,null,null,null,null,null,null,null,null,null,null,null,null,0,0,0,77.599999999999568,2.8865979381444014]
[null,null,null,null,null,null,null,null,null,null,null,null,null,null,0,0,0,77.699999999999562,2.8700128700129426]
[null,null,null,null,null,null,null,null,null,null,null,null,null,null,0,0,0,77.799999999999557,2.8534704370180677]
[null,null,null,null,null,null,null,null,null,null,null,null,null,null,0,0,0,77.899999999999551,2.8369704749679823]
[null,null,null,null,null,null,null,null,null,null,null,null,null,null,0,0,0,77.999999999999545,2.8205128205128958]
[null,null,null,null,null,null,null,null,null,null,null,null,null,null,0,0,0,78.09999999999954,2.8040973111396408]
[null,null,null,null,null,null,null,null,null,null,null,null,null,null,0,0,0,78.199999999999534,2.7877237851663175]
[null,null,null,null,null,null,null,null,null,null,null,null,null,null,0,0,0,78.299999999999528,2.7713920817369857]
[null,null,null,null,null,null,null,null,null,null,null,null,null,null,0,0,0,78.399999999999523,2.7551020408164035]
[null,null,null,null,null,null,null,null,null,null,null,null,null,null,0,0,0,78.499999999999517,2.7388535031847923]
[null,null,null,null,null,null,null,null,null,null,null,null,null,null,0,0,0,78.599999999999511,2.7226463104326495]
[null,null,null,null,null,null,null,null,null,null,null,null,null,null,0,0,0,78.699999999999505,2.7064803049556065]
[null,null,null,null,null,null,null,null,null,null,null,null,null,null,0,0,0,78.7999999999995,2.6903553299493197]
[null,null,null,null,null,null,null,null,null,null,null,null,null,null,0,0,0,78.899999999999494,2.6742712294043898]
[null,null,null,null,null,null,null,null,null,null,null,null,null,null,0,0,0,78.999999999999488,2.6582278481013475]
[null,null,null,null,null,null,null,null,null,null,null,null,null,null,0,0,0,79.099999999999483,2.6422250316056459]
[null,null,null,null,null,null,null,null,null,null,null,null,null,null,0,0,0,79.199999999999477,2.6262626262627098]
[null,null,null,null,null,null,null,null,null,null,null,null,null,null,0,0,0,79.299999999999471,2.610340479193022]
[null,null,null,null,null,null,null,null,null,null,null,null,null,null,0,0,0,79.399999999999466,2.5944584382872389]
[null,null,null,null,null,null,null,null,null,null,null,null,null,null,0,0,0,79.49999999999946,2.5786163522013439]
[null,null,null,null,null,null,null,null,null,null,null,null,null,null,0,0,0,79.599999999999454,2.5628140703518447]
[null,null,null,null,null,null,null,null,null,null,null,null,null,null,0,0,0,79.699999999999449,2.5470514429110036]
[null,null,null,null,null,null,null,null,null,null,null,null,null,null,0,0,0,79.799999999999443,2.5313283208020927]
[null,null,null,null,null,null,null,null,null,null,null,null,null,null,0,0,0,79.899999999999437,2.5156445556947062]
[null,null,null,null,null,null,null,null,null,null,null,null,null,null,0,0,0,79.999999999999432,2.5000000000000888]
[null,null,null,null,null,null,null,null,null,null,null,null,null,null,0,0,0,80.099999999999426,2.4843945068665061]
[null,null,null,null,null,null,null,null,null,null,null,null,null,null,0,0,0,80.19999999999942,2.468827930174653]
[null,null,null,null,null,null,null,null,null,null,null,null,null,null,0,0,0,80.299999999999415,2.4533001245330919]
[null,null,null,null,null,null,null,null,null,null,null,null,null,null,0,0,0,80.399999999999409,2.4378109452737231]
[null,null,null,null,null,null,null,null,null,null,null,null,null,null,0,0,0,80.499999999999403,2.4223602484472977]
[null,null,null,null,null,null,null,null,null,null,null,null,null,null,0,0,0,80.599999999999397,2.4069478908189517]
[null,null,null,null,null,null,null,null,null,null,null,null,null,null,0,0,0,80.699999999999392,2.3915737298637865]
[null,null,null,null,null,null,null,null,null,null,null,null,null,null,0,0,0,80.799999999999386,2.3762376237624707]
[null,null,null,null,null,null,null,null,null,null,null,null,null,null,0,0,0,80.89999999999938,2.360939431396881]
[null,null,null,null,null,null,null,null,null,null,null,null,null,null,0,0,0,80.999999999999375,2.3456790123457747]
[null,null,null,null,null,null,null,null,null,null,null,null,null,null,0,0,0,81.099999999999369,2.3304562268804911]
[null,null,null,null,null,null,null,null,null,null,null,null,null,null,0,0,0,81.199999999999363,2.3152709359606884]
[null,null,null,null,null,null,null,null,null,null,null,null,null,null,{"$f":"IF(F$6>0.2*($S479),(F$6-0.2*($S479))^2/(F$6+0.8*($S479)),0)","v":0},{"$f":"IF(G$6>0.2*($S479),(G$6-0.2*($S479))^2/(G$6+0.8*($S479)),0)","v":0},{"$f":"IF(H$6>0.2*($S479),(H$6-0.2*($S479))^2/(H$6+0.8*($S479)),0)","v":0},81.299999999999358,{"$f":"IF(R479>0,1000/R479-10,1000)","v":2.3001230012301086}]
[null,null,null,null,null,null,null,null,null,null,null,null,null,null,0,0,0,{"$f":"R479+0.1","v":81.399999999999352},2.2850122850123835]
[null,null,null,null,null,null,null,null,null,null,null,null,null,null,0,0,0,81.499999999999346,2.2699386503068464]
[null,null,null,null,null,null,null,null,null,null,null,null,null,null,0,0,0,81.599999999999341,2.2549019607844123]
[null,null,null,null,null,null,null,null,null,null,null,null,null,null,0,0,0,81.699999999999335,2.2399020807834535]
[null,null,null,null,null,null,null,null,null,null,null,null,null,null,0,0,0,81.799999999999329,2.2249388753057229]
[null,null,null,null,null,null,null,null,null,null,null,null,null,null,0,0,0,81.899999999999324,2.2100122100123105]
[null,null,null,null,null,null,null,null,null,null,null,null,null,null,0,0,0,81.999999999999318,2.1951219512196136]
[null,null,null,null,null,null,null,null,null,null,null,null,null,null,0,0,0,82.099999999999312,2.1802679658953519]
[null,null,null,null,null,null,null,null,null,null,null,null,null,null,0,0,0,82.199999999999307,2.1654501216546045]
[null,null,null,null,null,null,null,null,null,null,null,null,null,null,0,0,0,82.299999999999301,2.1506682867558755]
[null,null,null,null,null,null,null,null,null,null,null,null,null,null,0,0,0,82.399999999999295,2.1359223300971912]
[null,null,null,null,null,null,null,null,null,null,null,null,null,null,0,0,0,82.499999999999289,2.1212121212122259]
[null,null,null,null,null,null,null,null,null,null,null,null,null,null,0,0,0,82.599999999999284,2.1065375302664489]
[null,null,null,null,null,null,null,null,null,null,null,null,null,null,0,0,0,82.699999999999278,2.0918984280533106]
[null,null,null,null,null,null,null,null,null,null,null,null,null,null,0,0,0,82.799999999999272,2.0772946859904451]
[null,null,null,null,null,null,null,null,null,null,null,null,null,null,0,0,0,82.899999999999267,2.062726176115909]
[null,null,null,null,null,null,null,null,null,null,null,null,null,null,0,0,0,82.999999999999261,2.0481927710844445]
[null,null,null,null,null,null,null,null,null,null,null,null,null,null,0,0,0,83.099999999999255,2.0336943441637665]
[null,null,null,null,null,null,null,null,null,null,null,null,null,null,0,0,0,83.19999999999925,2.0192307692308784]
[null,null,null,null,null,null,null,null,null,null,null,null,null,null,0,0,0,83.299999999999244,2.0048019207684167]
[null,null,null,null,null,null,null,null,null,null,null,null,null,null,0,0,0,83.399999999999238,1.9904076738610215]
[null,null,null,null,null,null,null,null,null,null,null,null,null,null,0,0,0,83.499999999999233,1.9760479041917272]
[null,null,null,null,null,null,null,null,null,null,null,null,null,null,0,0,0,83.599999999999227,1.9617224880383883]
[null,null,null,null,null,null,null,null,null,null,null,null,null,null,0,0,0,83.699999999999221,1.9474313022701235]
[null,null,null,null,null,null,null,null,null,null,null,null,null,null,0,0,0,83.799999999999216,1.9331742243437873]
[null,null,null,null,null,null,null,null,null,null,null,null,null,null,0,0,0,83.89999999999921,1.9189511323004691]
[null,null,null,null,null,null,null,null,null,null,null,null,null,null,0,0,0,83.999999999999204,1.904761904762017]
[null,null,null,null,null,null,null,null,null,null,null,null,null,null,0,0,0,84.099999999999199,1.8906064209275808]
[null,null,null,null,null,null,null,null,null,null,null,null,null,null,0,0,0,84.199999999999193,1.8764845605701854]
[null,null,null,null,null,null,null,null,null,null,null,null,null,null,0,0,0,84.299999999999187,1.8623962040333293]
[null,null,null,null,null,null,null,null,null,null,null,null,null,null,0,0,0,84.399999999999181,1.8483412322276038]
[null,null,null,null,null,null,null,null,null,null,null,null,null,null,0,0,0,84.499999999999176,1.8343195266273344]
[null,null,null,null,null,null,null,null,null,null,null,null,null,null,0,0,0,84.59999999999917,1.8203309692672551]
[null,null,null,null,null,null,null,null,null,null,null,null,null,null,0,0,0,84.699999999999164,1.8063754427391956]
[null,null,null,null,null,null,null,null,null,null,null,null,null,null,0,0,0,84.799999999999159,1.7924528301887968]
[null,null,null,null,null,null,null,null,null,null,null,null,null,null,0,0,0,84.899999999999153,1.7785630153122494]
[null,null,null,null,null,null,null,null,null,null,null,null,null,null,0,0,0,84.999999999999147,1.7647058823530593]
[null,null,null,null,null,null,null,null,null,null,null,null,null,null,0,0,0,85.099999999999142,1.7508813160988268]
[null,null,null,null,null,null,null,null,null,null,null,null,null,null,0,0,0,85.199999999999136,1.737089201878053]
[null,null,null,null,null,null,null,null,null,null,null,null,null,null,0,0,0,85.29999999999913,1.7233294255569778]
[null,null,null,null,null,null,null,null,null,null,null,null,null,null,0,0,0,85.399999999999125,1.7096018735364193]
[null,null,null,null,null,null,null,null,null,null,null,null,null,null,0,0,0,85.499999999999119,1.695906432748659]
[null,null,null,null,null,null,null,null,null,null,null,null,null,null,0,0,0,85.599999999999113,1.682242990654327]
[null,null,null,null,null,null,null,null,null,null,null,null,null,null,0,0,0,85.699999999999108,1.6686114352393275]
[null,null,null,null,null,null,null,null,null,null,null,null,null,null,0,0,0,85.799999999999102,1.6550116550117764]
[null,null,null,null,null,null,null,null,null,null,null,null,null,null,0,0,0,85.899999999999096,1.6414435389989581]
[null,null,null,null,null,null,null,null,null,null,null,null,null,null,0,0,0,85.999999999999091,1.6279069767443097]
[null,null,null,null,null,null,null,null,null,null,null,null,null,null,0,0,0,86.099999999999085,1.6144018583044204]
[null,null,null,null,null,null,null,null,null,null,null,null,null,null,0,0,0,86.199999999999079,1.6009280742460632]
[null,null,null,null,null,null,null,null,null,null,null,null,null,null,0,0,0,86.299999999999073,1.5874855156432304]
[null,null,null,null,null,null,null,null,null,null,null,null,null,null,0,0,0,86.399999999999068,1.5740740740741987]
[null,null,null,null,null,null,null,null,null,null,null,null,null,null,0,0,0,86.499999999999062,1.5606936416186219]
[null,null,null,null,null,null,null,null,null,null,null,null,null,null,0,0,0,86.599999999999056,1.5473441108546293]
[null,null,null,null,null,null,null,null,null,null,null,null,null,null,0,0,0,86.699999999999051,1.5340253748559505]
[null,null,null,null,null,null,null,null,null,null,null,null,null,null,0,0,0,86.799999999999045,1.5207373271890674]
[null,null,null,null,null,null,null,null,null,null,null,null,null,null,0,0,0,86.899999999999039,1.5074798619103689]
[null,null,null,null,null,null,null,null,null,null,null,null,null,null,0,0,0,86.999999999999034,1.4942528735633456]
[null,null,null,null,null,null,null,null,null,null,null,null,null,null,0,0,0,87.099999999999028,1.4810562571757888]
[null,null,null,null,null,null,null,null,null,null,null,null,null,null,0,0,0,87.199999999999022,1.4678899082570087]
[null,null,null,null,null,null,null,null,null,null,null,null,null,null,0,0,0,87.299999999999017,1.4547537227950897]
[null,null,null,null,null,null,null,null,null,null,null,null,null,null,0,0,0,87.399999999999011,1.4416475972541338]
[null,null,null,null,null,null,null,null,null,null,null,null,null,null,0,0,0,87.499999999999005,1.4285714285715585]
[null,null,null,null,null,null,null,null,null,null,null,null,null,null,0,0,0,87.599999999999,1.4155251141553808]
[null,null,null,null,null,null,null,null,null,null,null,null,null,null,{"$f":"IF(F$6>0.2*($S543),(F$6-0.2*($S543))^2/(F$6+0.8*($S543)),0)","v":0},{"$f":"IF(G$6>0.2*($S543),(G$6-0.2*($S543))^2/(G$6+0.8*($S543)),0)","v":0},{"$f":"IF(H$6>0.2*($S543),(H$6-0.2*($S543))^2/(H$6+0.8*($S543)),0)","v":0},87.699999999998994,{"$f":"IF(R543>0,1000/R543-10,1000)","v":1.4025085518815441}]
[null,null,null,null,null,null,null,null,null,null,null,null,null,null,0,0,0,{"$f":"R543+0.1","v":87.799999999998988},1.3895216400912478]
[null,null,null,null,null,null,null,null,null,null,null,null,null,null,0,0,0,87.899999999998983,1.3765642775883009]
[null,null,null,null,null,null,null,null,null,null,null,null,null,null,0,0,0,87.999999999998977,1.3636363636364965]
[null,null,null,null,null,null,null,null,null,null,null,null,null,null,0,0,0,88.099999999998971,1.3507377979570006]
[null,null,null,null,null,null,null,null,null,null,null,null,null,null,0,0,0,88.199999999998965,1.3378684807257564]
[null,null,null,null,null,null,null,null,null,null,null,null,null,null,0,0,0,88.29999999999896,1.3250283125709146]
[null,null,null,null,null,null,null,null,null,null,null,null,null,null,0,0,0,88.399999999998954,1.3122171945702696]
[null,null,null,null,null,null,null,null,null,null,null,null,null,null,0,0,0,88.499999999998948,1.2994350282487215]
[null,null,null,null,null,null,null,null,null,null,null,null,null,null,0,0,0,88.599999999998943,1.2866817155757548]
[null,null,null,null,null,null,null,null,null,null,null,null,null,null,0,0,0,88.699999999998937,1.273957158962931]
[null,null,null,null,null,null,null,null,null,null,null,null,null,null,0,0,0,88.799999999998931,1.2612612612613976]
[null,null,null,null,null,null,null,null,null,null,null,null,null,null,0,0,0,88.899999999998926,1.2485939257594154]
[null,null,null,null,null,null,null,null,null,null,null,null,null,null,0,0,0,88.99999999999892,1.2359550561799111]
[null,null,null,null,null,null,null,null,null,null,null,null,null,null,0,0,0,89.099999999998914,1.2233445566780272]
[null,null,null,null,null,null,null,null,null,null,null,null,null,null,0,0,0,89.199999999998909,1.2107623318387031]
[null,null,null,null,null,null,null,null,null,null,null,null,null,null,0,0,0,89.299999999998903,1.1982082866742694]
[null,null,null,null,null,null,null,null,null,null,null,null,null,null,0,0,0,89.399999999998897,1.1856823266220626]
[null,null,null,null,null,null,null,null,null,null,null,null,null,null,0,0,0,89.499999999998892,1.1731843575420378]
[null,null,null,null,null,null,null,null,null,null,null,null,null,null,0,0,0,89.599999999998886,1.160714285714425]
[null,null,null,null,null,null,null,null,null,null,null,null,null,null,0,0,0,89.69999999999888,1.1482720178373746]
[null,null,null,null,null,null,null,null,null,null,null,null,null,null,0,0,0,89.799999999998875,1.1358574610246386]
[null,null,null,null,null,null,null,null,null,null,null,null,null,null,0,0,0,89.899999999998869,1.1234705228032542]
[null,null,null,null,null,null,null,null,null,null,null,null,null,null,0,0,0,89.999999999998863,1.111111111111251]
[null,null,null,null,null,null,null,null,null,null,null,null,null,null,0,0,0,90.099999999998857,1.0987791342953681]
[null,null,null,null,null,null,null,null,null,null,null,null,null,null,0,0,0,90.199999999998852,1.0864745011087891]
[null,null,null,null,null,null,null,null,null,null,null,null,null,null,0,0,0,90.299999999998846,1.0741971207088898]
[null,null,null,null,null,null,null,null,null,null,null,null,null,null,0,0,0,90.39999999999884,1.0619469026550092]
[null,null,null,null,null,null,null,null,null,null,null,null,null,null,0,0,0,90.499999999998835,1.0497237569062197]
[null,null,null,null,null,null,null,null,null,null,null,null,null,null,0,0,0,90.599999999998829,1.037527593819128]
[null,null,null,null,null,null,null,null,null,null,null,null,null,null,0,0,0,90.699999999998823,1.0253583241456781]
[null,null,null,null,null,null,null,null,null,null,null,null,null,null,0,0,0,90.799999999998818,1.0132158590309803]
[null,null,null,null,null,null,null,null,null,null,null,null,null,null,0,0,0,90.899999999998812,1.0011001100111443]
[null,null,null,null,null,null,null,null,null,null,null,null,null,null,0,0,0,90.999999999998806,0.98901098901113293]
[null,null,null,null,null,null,null,null,null,null,null,null,null,null,0,0,0,91.099999999998801,0.97694840834262564]
[null,null,null,null,null,null,null,null,null,null,null,null,null,null,0,0,0,91.199999999998795,0.96491228070189905]
[null,null,null,null,null,null,null,null,null,null,null,null,null,null,0,0,0,91.299999999998789,0.95290251916772384]
[null,null,null,null,null,null,null,null,null,null,null,null,null,null,0,0,0,91.399999999998784,0.94091903719927039]
[null,null,null,null,null,null,null,null,null,null,null,null,null,null,0,0,0,91.499999999998778,0.92896174863402514]
[null,null,null,null,null,null,null,null,null,null,null,null,null,null,0,0,0,91.599999999998772,0.91703056768573532]
[null,null,null,null,null,null,null,null,null,null,null,null,null,null,0,0,0,91.699999999998766,0.90512540894235016]
[null,null,null,null,null,null,null,null,null,null,null,null,null,null,0,0,0,91.799999999998761,0.89324618736398165]
[null,null,null,null,null,null,null,null,null,null,null,null,null,null,0,0,0,91.899999999998755,0.88139281828088656]
[null,null,null,null,null,null,null,null,null,null,null,null,null,null,0,0,0,91.999999999998749,0.86956521739145209]
[null,null,null,null,null,null,null,null,null,null,null,null,null,null,0,0,0,92.099999999998744,0.85776330076019214]
[null,null,null,null,null,null,null,null,null,null,null,null,null,null,0,0,0,92.199999999998738,0.84598698481576662]
[null,null,null,null,null,null,null,null,null,null,null,null,null,null,0,0,0,92.299999999998732,0.83423618634901153]
[null,null,null,null,null,null,null,null,null,null,null,null,null,null,0,0,0,92.399999999998727,0.82251082251097252]
[null,null,null,null,null,null,null,null,null,null,null,null,null,null,0,0,0,92.499999999998721,0.81081081081095974]
[null,null,null,null,null,null,null,null,null,null,null,null,null,null,0,0,0,92.599999999998715,0.79913606911462054]
[null,null,null,null,null,null,null,null,null,null,null,null,null,null,0,0,0,92.69999999999871,0.787486515642005]
[null,null,null,null,null,null,null,null,null,null,null,null,null,null,0,0,0,92.799999999998704,0.77586206896566701]
[null,null,null,null,null,null,null,null,null,null,null,null,null,null,0,0,0,92.899999999998698,0.76426264800876176]
[null,null,null,null,null,null,null,null,null,null,null,null,null,null,0,0,0,92.999999999998693,0.75268817204316107]
[null,null,null,null,null,null,null,null,null,null,null,null,null,null,0,0,0,93.099999999998687,0.74113856068758466]
[null,null,null,null,null,null,null,null,null,null,null,null,null,null,0,0,0,93.199999999998681,0.72961373390573137]
[null,null,null,null,null,null,null,null,null,null,null,null,null,null,0,0,0,93.299999999998676,0.71811361200443891]
[null,null,null,null,null,null,null,null,null,null,null,null,null,null,0,0,0,93.39999999999867,0.70663811563184353]
[null,null,null,null,null,null,null,null,null,null,null,null,null,null,0,0,0,93.499999999998664,0.69518716577555395]
[null,null,null,null,null,null,null,null,null,null,null,null,null,null,0,0,0,93.599999999998658,0.68376068376083765]
[null,null,null,null,null,null,null,null,null,null,null,null,null,null,0,0,0,93.699999999998653,0.67235859124881969]
[null,null,null,null,null,null,null,null,null,null,null,null,null,null,0,0,0,93.799999999998647,0.66098081023469568]
[null,null,null,null,null,null,null,null,null,null,null,null,null,null,0,0,0,93.899999999998641,0.64962726304594831]
[null,null,null,null,null,null,null,null,null,null,null,null,null,null,0,0,0,93.999999999998636,0.63829787234057989]
[null,null,null,null,null,null,null,null,null,null,null,null,null,null,{"$f":"IF(F$6>0.2*($S607),(F$6-0.2*($S607))^2/(F$6+0.8*($S607)),0)","v":0},{"$f":"IF(G$6>0.2*($S607),(G$6-0.2*($S607))^2/(G$6+0.8*($S607)),0)","v":0},{"$f":"IF(H$6>0.2*($S607),(H$6-0.2*($S607))^2/(H$6+0.8*($S607)),0)","v":0},94.09999999999863,{"$f":"IF(R607>0,1000/R607-10,1000)","v":0.62699256110536261}]
[null,null,null,null,null,null,null,null,null,null,null,null,null,null,0,0,0,{"$f":"R607+0.1","v":94.199999999998624},0.61571125265408355]
[null,null,null,null,null,null,null,null,null,null,null,null,null,null,0,0,0,94.299999999998619,0.60445387062581801]
[null,null,null,null,null,null,null,null,null,null,null,null,null,null,0,0,0,94.399999999998613,0.59322033898320647]
[null,null,null,null,null,null,null,null,null,null,null,null,null,null,0,0,0,94.499999999998607,0.58201058201073863]
[null,null,null,null,null,null,null,null,null,null,null,null,null,null,0,0,0,94.599999999998602,0.57082452431305342]
[null,null,null,null,null,null,null,null,null,null,null,null,null,null,0,0,0,94.699999999998596,0.55966209081324969]
[null,null,null,null,null,null,null,null,null,null,null,null,null,null,0,0,0,94.79999999999859,0.54852320675121113]
[null,null,null,null,null,null,null,null,null,null,null,null,null,null,0,0,0,94.899999999998585,0.53740779768192759]
[null,null,null,null,null,null,null,null,null,null,null,null,null,null,0,0,0,94.999999999998579,0.52631578947384128]
[null,null,null,null,null,null,null,null,null,null,null,null,null,null,0,0,0,95.099999999998573,0.51524710830720366]
[null,null,null,null,null,null,null,null,null,null,null,null,null,null,0,0,0,95.199999999998568,0.50420168067242699]
[null,null,null,null,null,null,null,null,null,null,null,null,null,null,0,0,0,95.299999999998562,0.49317943336846959]
[null,null,null,null,null,null,null,null,null,null,null,null,null,null,0,0,0,95.399999999998556,0.48218029350120695]
[null,null,null,null,null,null,null,null,null,null,null,null,null,null,0,0,0,95.49999999999855,0.47120418848183476]
[null,null,null,null,null,null,null,null,null,null,null,null,null,null,0,0,0,95.599999999998545,0.46025104602526312]
[null,null,null,null,null,null,null,null,null,null,null,null,null,null,0,0,0,95.699999999998539,0.44932079414853909]
[null,null,null,null,null,null,null,null,null,null,null,null,null,null,0,0,0,95.799999999998533,0.43841336116926222]
[null,null,null,null,null,null,null,null,null,null,null,null,null,null,0,0,0,95.899999999998528,0.42752867570401776]
[null,null,null,null,null,null,null,null,null,null,null,null,null,null,0,0,0,95.999999999998522,0.41666666666682772]
[null,null,null,null,null,null,null,null,null,null,null,null,null,null,0,0,0,96.099999999998516,0.40582726326759122]
[null,null,null,null,null,null,null,null,null,null,null,null,null,null,0,0,0,96.199999999998511,0.39501039501055679]
[null,null,null,null,null,null,null,null,null,null,null,null,null,null,0,0,0,96.299999999998505,0.38421599169278764]
[null,null,null,null,null,null,null,null,null,null,null,null,null,null,0,0,0,96.399999999998499,0.37344398340265172]
[null,null,null,null,null,null,null,null,null,null,null,null,null,null,0,0,0,96.499999999998494,0.36269430051829588]
[null,null,null,null,null,null,null,null,null,null,null,null,null,null,0,0,0,96.599999999998488,0.35196687370616608]
[null,null,null,null,null,null,null,null,null,null,null,null,null,null,0,0,0,96.699999999998482,0.34126163391950115]
[null,null,null,null,null,null,null,null,null,null,null,null,null,null,0,0,0,96.799999999998477,0.33057851239685654]
[null,null,null,null,null,null,null,null,null,null,null,null,null,null,0,0,0,96.899999999998471,0.3199174406606371]
[null,null,null,null,null,null,null,null,null,null,null,null,null,null,0,0,0,96.999999999998465,0.30927835051562624]
[null,null,null,null,null,null,null,null,null,null,null,null,null,null,0,0,0,97.09999999999846,0.29866117404753645]
[null,null,null,null,null,null,null,null,null,null,null,null,null,null,0,0,0,97.199999999998454,0.28806584362156329]
[null,null,null,null,null,null,null,null,null,null,null,null,null,null,0,0,0,97.299999999998448,0.27749229188094482]
[null,null,null,null,null,null,null,null,null,null,null,null,null,null,0,0,0,97.399999999998442,0.26694045174554404]
[null,null,null,null,null,null,null,null,null,null,null,null,null,null,0,0,0,97.499999999998437,0.2564102564104207]
[null,null,null,null,null,null,null,null,null,null,null,null,null,null,0,0,0,97.599999999998431,0.24590163934442621]
[null,null,null,null,null,null,null,null,null,null,null,null,null,null,0,0,0,97.699999999998425,0.23541453428880388]
[null,null,null,null,null,null,null,null,null,null,null,null,null,null,0,0,0,97.79999999999842,0.2249488752557891]
[null,null,null,null,null,null,null,null,null,null,null,null,null,null,0,0,0,97.899999999998414,0.21450459652723453]
[null,null,null,null,null,null,null,null,null,null,null,null,null,null,0,0,0,97.999999999998408,0.20408163265322621]
[null,null,null,null,null,null,null,null,null,null,null,null,null,null,0,0,0,98.099999999998403,0.19367991845072652]
[null,null,null,null,null,null,null,null,null,null,null,null,null,null,0,0,0,98.199999999998397,0.18329938900220277]
[null,null,null,null,null,null,null,null,null,null,null,null,null,null,0,0,0,98.299999999998391,0.17293997965428609]
[null,null,null,null,null,null,null,null,null,null,null,null,null,null,0,0,0,98.399999999998386,0.16260162601642669]
[null,null,null,null,null,null,null,null,null,null,null,null,null,null,0,0,0,98.49999999999838,0.15228426395955807]
[null,null,null,null,null,null,null,null,null,null,null,null,null,null,0,0,0,98.599999999998374,0.14198782961477185]
[null,null,null,null,null,null,null,null,null,null,null,null,null,null,0,0,0,98.699999999998369,0.13171225937200148]
[null,null,null,null,null,null,null,null,null,null,null,null,null,null,0,0,0,98.799999999998363,0.12145748987870952]
[null,null,null,null,null,null,null,null,null,null,null,null,null,null,0,0,0,98.899999999998357,0.11122345803859091]
[null,null,null,null,null,null,null,null,null,null,null,null,null,null,0,0,0,98.999999999998352,0.10101010101026908]
[null,null,null,null,null,null,null,null,null,null,null,null,null,null,0,0,0,99.099999999998346,9.0817356206020605E-2]
[null,null,null,null,null,null,null,null,null,null,null,null,null,null,0,0,0,99.19999999999834,8.0645161290490819E-2]
[null,null,null,null,null,null,null,null,null,null,null,null,null,null,0,0,0,99.299999999998334,7.0493454179423765E-2]
[null,null,null,null,null,null,null,null,null,null,null,null,null,null,0,0,0,99.399999999998329,6.0362173038399192E-2]
[null,null,null,null,null,null,null,null,null,null,null,null,null,null,0,0,0,99.499999999998323,5.0251256281576673E-2]
[null,null,null,null,null,null,null,null,null,null,null,null,null,null,0,0,0,99.599999999998317,4.0160642570450378E-2]
[null,null,null,null,null,null,null,null,null,null,null,null,null,null,0,0,0,99.699999999998312,3.00902708126074E-2]
[null,null,null,null,null,null,null,null,null,null,null,null,null,null,0,0,0,99.799999999998306,2.0040080160491414E-2]
[null,null,null,null,null,null,null,null,null,null,null,null,null,null,0,0,0,99.8999999999983,1.0010010010180537E-2]
[null,null,null,null,null,null,null,null,null,null,null,null,null,null,0,0,0,99.999999999998295,1.7053025658242404E-13]

{"sheet":"Summary","index":8,"n_rows":89,"n_cols":11,"rows_kept":89,"cut":false,"hidden":false,"merged":[[5,8,8,9],[32,2,32,5],[33,2,33,5],[37,1,38,2],[37,3,38,3],[30,2,30,3],[25,2,25,3],[26,2,26,3],[27,2,27,3],[28,2,28,3],[7,2,7,3],[6,2,6,3],[4,1,4,4],[5,1,5,4],[80,1,82,1],[83,1,85,1],[86,1,88,1],[46,1,46,2]]}
[]
[null,{"$f":"Site!E1","v":"DEQ Virginia Runoff Reduction Method Re-Development Compliance Spreadsheet  - Version 3.0 "}]
[]
[null,{"$f":"Site!G11","v":"BMP Design Specifications List:"},{"$f":"Site!J11","v":"2013 Draft Stds & Specs"}]
[null,{"$f":"IF(Site!E6=\"Yes\",\"Site Summary - Linear Development Project***\",\"Site Summary\")","v":"Site Summary"}]
[null,{"$f":"IF(Site!B4=\"\",\"Project Title: NA\",\"Project Title: \" &Site!B4)","v":"Project Title: NA"}]
[null,{"$f":"IF(Site!B5=\"\",\"Date: NA\",\"Date: \" &Site!B5)","v":"Date: NA"},"Total Rainfall (in):",null,{"$f":"Site!B31","v":43}]
[null,null,"Total Disturbed Acreage: ",null,{"$f":"Site!F10","v":0}]
[]
[null,"Site Land Cover Summary",{"$f":"IF(Site!F10=\"ENTER TOTAL DISTURBED ACREAGE ABOVE!\", \"DISTURBED ACREAGE NOT ENTERED ON SITE TAB!\",IF(Site!F10>Site!F27,\"TOTAL DISTURBED ACREAGE GREATER THAN POST-DEVELOPMENT AREA IN SITE TAB!\",\"\"))","v":""}]
[]
[null,"Pre-ReDevelopment Land Cover  (acres)"]
[null,null,"A soils","B Soils","C Soils","D Soils","Totals","% of Total"]
[null,"Forest/Open (acres)",{"$f":"Site!B17","v":0},{"$f":"Site!C17","v":0},{"$f":"Site!D17","v":0},{"$f":"Site!E17","v":0},{"$f":"Site!F17","v":0},{"$f":"IF(G$17>0,G14/G$17*100,0)","v":0}]
[null,"Managed Turf (acres)",{"$f":"Site!B18","v":0},{"$f":"Site!C18","v":0},{"$f":"Site!D18","v":0},{"$f":"Site!E18","v":0},{"$f":"Site!F18","v":0},{"$f":"IF(G$17>0,G15/G$17*100,0)","v":0}]
[null,"Impervious Cover (acres)",{"$f":"Site!B19","v":0},{"$f":"Site!C19","v":0},{"$f":"Site!D19","v":0},{"$f":"Site!E19","v":0},{"$f":"Site!F19","v":0},{"$f":"IF(G$17>0,G16/G$17*100,0)","v":0}]
[null,null,null,null,null,null,{"$f":"Site!F20","v":0},{"$f":"SUM(H14:H16)","v":0}]
[]
[null,"Post-ReDevelopment Land Cover  (acres)"]
[null,null,"A soils","B Soils","C Soils","D Soils","Totals","% of Total"]
[null,"Forest/Open (acres)",{"$f":"Site!B24","v":0},{"$f":"Site!C24","v":0},{"$f":"Site!D24","v":0},{"$f":"Site!E24","v":0},{"$f":"Site!F24","v":0},{"$f":"IF(G$17>0,G21/G$17*100,0)","v":0},{"$f":"IF(Site!F24>0,\"*\",\"\")","v":""}]
[null,"Managed Turf (acres)",{"$f":"Site!B25","v":0},{"$f":"Site!C25","v":0},{"$f":"Site!D25","v":0},{"$f":"Site!E25","v":0},{"$f":"Site!F25","v":0},{"$f":"IF(G$17>0,G22/G$17*100,0)","v":0}]
[null,"Impervious Cover (acres)",{"$f":"Site!B26","v":0},{"$f":"Site!C26","v":0},{"$f":"Site!D26","v":0},{"$f":"Site!E26","v":0},{"$f":"Site!F26","v":0},{"$f":"IF(G$17>0,G23/G$17*100,0)","v":0}]
[null,{"$f":"IF(Site!F24>0,\"* Forest/Open Space areas must be protected in accordance with the Virginia Runoff Reduction Method\",\"\")","v":""},null,null,null,null,{"$f":"Site!F27","v":0},{"$f":"SUM(H21:H23)","v":0}]
[null,"Site Tv and Land Cover Nutrient Loads"]
[null,null,"Final Post-Development \n(Post-ReDevelopment \n& New Impervious)",null,"Post-ReDevelopment","Post-Development (New Impervious)","Adjusted Pre-ReDevelopment",null,{"$f":"Site!A57","v":"Pre-ReDevelopment TP Load per acre\n(lb/acre/yr)"},{"$f":"Site!E57","v":"Final Post-Development TP Load per acre \n(lb/acre/yr)"},{"$f":"Site!H57","v":"Post-ReDevelopment TP Load per acre \n(lb/acre/yr)"}]
[null,"Site Rv",{"$f":"Site!F52","v":"--"},null,{"$f":"Site!I52","v":"--"},{"$f":"Site!L49","v":"--"},{"$f":"Site!C52","v":"--"},null,{"$f":"Site!C57","v":"--"},{"$f":"Site!F57","v":"--"},{"$f":"Site!I57","v":"--"}]
[null,"Treatment Volume (ft3) ",{"$f":"Site!F55","v":"--"},null,{"$f":"Site!I55","v":"--"},{"$f":"Site!L55","v":"--"},{"$f":"Site!C55","v":"--"}]
[null,"TP Load (lb/yr)",{"$f":"Site!F56","v":"--"},null,{"$f":"Site!I56","v":"--"},{"$f":"Site!L56","v":"--"},{"$f":"Site!C56","v":"--"}]
[null,null,null,{"$f":"IF(Site!D56=\"*\",\"Baseline TP Load (lb/yr):\",\"\")","v":""},{"$f":"IF(Site!D56=\"*\",Site!C58&\"*\",\"\")","v":""},{"$f":"IF(Site!D56=\"*\",\"*Reduction below new development load limitation not required\",\"\")","v":""}]
[null,"Total TP Load Reduction Required (lb/yr)",{"$f":"IF(Site!G63=\"--\",\"--\",IF(Site!$G$63=Site!$O$2,\"Check Areas!\",IF(Site!$E6=\"yes\",ROUND(Site!$G$64,2),Site!$G$63)))","v":"--"},null,{"$f":"IF(Site!$E6=\"yes\",\"N/A***\",IF(Site!I60=Site!$O$3,\"x\",Site!I60))","v":"--"},{"$f":"IF(Site!$E6=\"yes\",\"N/A***\",IF(Site!$L$60=Site!$O$3,\"x\",Site!$L$60))","v":"--"}]
[null,null,{"$f":"IF(Site!E6=\"yes\",\"***This is a linear development project\",\"\")","v":""}]
[null,null,"Final Post-Development Load \n(Post-ReDevelopment & New Impervious) ",null,null,null,"Pre-ReDevelopment"]
[null,"TN Load (lb/yr)",{"$f":"Site!I67","v":"--"},null,null,null,{"$f":"Site!D67","v":"--"}]
[]
[null,{"$f":"IF(C36=\"\",\"Site Compliance Summary\",\"Site Compliance Summary -\")","v":"Site Compliance Summary"},{"$f":"IF(Site!E6=\"yes\",\"***Linear Development Project\",\"\")","v":""}]
[]
[null,"Maximum % Reduction Required Below \nPre-ReDevelopment Load",null,{"$f":"IF(Site!I58=Site!$O$2,\"x\",Site!$I58)","v":"--"},{"$f":"IF(Site!D56=\"*\",\"  * Note: % Reduction will reduce post-development TP load to less than or equal to baseline load of \"&ROUND(Site!C58,2)&\" lb/yr (0.41 lb/ac/yr)\",\"\")","v":""}]
[null,null,null,null,{"$f":"IF(D30=\"\",\"\",IF(Site!E6=\"yes\",\"[Post-Dev Reduction Requirement = Post-Dev TP load - baseline load of \"&ROUND(Site!C58,2)&\" lb/yr], baseline load = site area x 0.41 lb/ac/yr\",IF(E38=\"\",\"\",\"    [Required reduction for Post-ReDev. = Post-ReDev TP load - baseline load of \"&Site!C58&\" lb/yr], baseline load = site area x 0.41 lb/ac/yr\")))","v":""}]
[]
[]
[null,"Total Runoff Volume Reduction (ft3)  ",{"$f":"'Water Quality Compliance'!H14","v":0},null,{"$f":"IF(AND(E43=E44,E44=E45,Site!P5=0),\"\",IF(Site!P5=\"incomplete\",\"Site tab incomplete\",\"Error Summary:\"))","v":""}]
[null,"Total TP Load Reduction Achieved (lb/yr)",{"$f":"IF(Site!E6=\"yes\",'Water Quality Compliance'!E24,'Water Quality Compliance'!C24)","v":"--"},null,{"$f":"IF(Site!P5=0,\"\",\"Errors on Site tab\")","v":""}]
[null,"Total TN Load Reduction Achieved (lb/yr)",{"$f":"'Water Quality Compliance'!C30","v":"--"},null,{"$f":"IF((COUNTIF(C55:G55,\"\"))=5,\"\",\" Errors on D.A. tab(s)\")","v":""}]
[null,"Remaining Post Development TP Load (lb/yr)",{"$f":"IFERROR(C29-C43,\"--\")","v":"--"},null,{"$f":"IF(OR(I51=\"X\", I52=\"X\",I53=\"X\"),\" Areas on D.A. tab(s) exceed Site tab areas\",\"\")","v":""}]
[null,"Remaining TP Load Reduction (lb/yr) Required",{"$f":"IFERROR(IF(AND(E43=E44,E44=E45),(IF(Site!E6=\"yes\",'Water Quality Compliance'!E26,'Water Quality Compliance'!C26)),\"Check Errors!\"),\"--\")","v":"--"},{"$f":"IF(C46=\"Check Errors!\",\"\",IF(Site!E6=\"no\",'Water Quality Compliance'!B27,'Water Quality Compliance'!F26))","v":""}]
[null,{"$f":"F30","v":""},null,{"$f":"IFERROR(IF(AND(C31-C43<0.005,C43<C31),\"      (Remaining TP load reduction <0.005)\",\"\"),\"\")","v":""}]
[null,"Drainage Area Summary"]
[]
[null,null,"D.A. A","D.A. B","D.A. C","D.A. D","D.A. E","Total"]
[null,"Forest/Open (acres)",{"$f":"'D.A. A'!F5","v":0},{"$f":"'D.A. B'!F5","v":0},{"$f":"'D.A. C'!F5","v":0},{"$f":"'D.A. D'!F5","v":0},{"$f":"'D.A. E'!F5","v":0},{"$f":"SUM(C51:G51)","v":0},{"$f":"IF(Site!F24<('D.A. A'!F5+'D.A. B'!F5+'D.A. C'!F5+'D.A. D'!F5+'D.A. E'!F5),\"X\",\"\")","v":""}]
[null,"Managed Turf (acres)",{"$f":"'D.A. A'!F6","v":0},{"$f":"'D.A. B'!F6","v":0},{"$f":"'D.A. C'!F6","v":0},{"$f":"'D.A. D'!F6","v":0},{"$f":"'D.A. E'!F6","v":0},{"$f":"SUM(C52:G52)","v":0},{"$f":"IF('Water Quality Compliance'!H6=\"OK.\",\"\",\"X\")","v":""}]
[null,"Impervious Cover (acres)",{"$f":"'D.A. A'!F7","v":0},{"$f":"'D.A. B'!F7","v":0},{"$f":"'D.A. C'!F7","v":0},{"$f":"'D.A. D'!F7","v":0},{"$f":"'D.A. E'!F7","v":0},{"$f":"SUM(C53:G53)","v":0},{"$f":"IF('Water Quality Compliance'!H4=\"OK.\",\"\",\"X\")","v":""}]
[null,"Total Area (acres)",{"$f":"SUM(C51:C53)","v":0},{"$f":"SUM(D51:D53)","v":0},{"$f":"SUM(E51:E53)","v":0},{"$f":"SUM(F51:F53)","v":0},{"$f":"SUM(G51:G53)","v":0},{"$f":" SUM(H51:H53)","v":0}]
[null,null,{"$f":"IF('Water Quality Compliance'!C8=\"OK.\",\"\",\"D.A. A Errors!\")","v":""},{"$f":"IF('Water Quality Compliance'!D8=\"OK.\",\"\",\"D.A. B Errors!\")","v":""},{"$f":"IF('Water Quality Compliance'!E8=\"OK.\",\"\",\"D.A. C Errors!\")","v":""},{"$f":"IF('Water Quality Compliance'!F8=\"OK.\",\"\",\"D.A. D Errors!\")","v":""},{"$f":"IF('Water Quality Compliance'!G8=\"OK.\",\"\",\"D.A. E Errors!\")","v":""}]
[null,"Drainage Area Compliance Summary"]
[]
[null,null,"D.A. A","D.A. B","D.A. C","D.A. D","D.A. E","Total"]
[null,"TP Load Reduced (lb/yr)",{"$f":"'D.A. A'!I104","v":0},{"$f":"'D.A. B'!I104","v":0},{"$f":"'D.A. C'!I104","v":0},{"$f":"'D.A. D'!I104","v":0},{"$f":"'D.A. E'!I104","v":0},{"$f":"SUM(C59:G59)","v":0}]
[null,"TN Load Reduced (lb/yr)",{"$f":"'D.A. A'!I111","v":0},{"$f":"'D.A. B'!I111","v":0},{"$f":"'D.A. C'!I111","v":0},{"$f":"'D.A. D'!I111","v":0},{"$f":"'D.A. E'!I111","v":0},{"$f":"SUM(C60:G60)","v":0}]
[]
[]
[]
[]
[]
[]
[]
[]
[]
[]
[]
[]
[null,"Runoff Volume and CN Calculations"]
[]
[null,null,"1-year storm","2-year storm ","10-year storm "]
[null,"Target Rainfall Event (in)",{"$f":"'Runoff Volume and CN'!$F$6","v":0},{"$f":"'Runoff Volume and CN'!$G$6","v":0},{"$f":"'Runoff Volume and CN'!$H$6","v":0}]
[]
[null,"Drainage Areas","RV & CN","Drainage Area A","Drainage Area B","Drainage Area C","Drainage Area D","Drainage Area E"]
[null,"CN",null,{"$f":"'Runoff Volume and CN'!$I$31","v":0},{"$f":"'Runoff Volume and CN'!$I$45","v":0},{"$f":"'Runoff Volume and CN'!$I$59","v":0},{"$f":"'Runoff Volume and CN'!$I$73","v":0},{"$f":"'Runoff Volume and CN'!$I$87","v":0}]
[null,"RR (ft3)",null,{"$f":"'D.A. A'!$F$60","v":0},{"$f":"'D.A. B'!$F$60","v":0},{"$f":"'D.A. C'!$F$60","v":0},{"$f":"'D.A. D'!$F$60","v":0},{"$f":"'D.A. E'!$F$60","v":0}]
[null,"1-year return period","RV wo RR (ws-in)",{"$f":"'Runoff Volume and CN'!$F$33","v":0},{"$f":"'Runoff Volume and CN'!$F$47","v":0},{"$f":"'Runoff Volume and CN'!$F$61","v":0},{"$f":"'Runoff Volume and CN'!$F$75","v":0},{"$f":"'Runoff Volume and CN'!$F$89","v":0}]
[null,null,"RV w RR (ws-in)",{"$f":"'Runoff Volume and CN'!$F$34","v":0},{"$f":"'Runoff Volume and CN'!$F$48","v":0},{"$f":"'Runoff Volume and CN'!$F$62","v":0},{"$f":"'Runoff Volume and CN'!$F$76","v":0},{"$f":"'Runoff Volume and CN'!$F$90","v":0}]
[null,null,"CN adjusted",{"$f":"'Runoff Volume and CN'!$F$35","v":0},{"$f":"'Runoff Volume and CN'!$F$49","v":0},{"$f":"'Runoff Volume and CN'!$F$63","v":0},{"$f":"'Runoff Volume and CN'!$F$77","v":0},{"$f":"'Runoff Volume and CN'!$F$91","v":0}]
[null,"2-year return period","RV wo RR (ws-in)",{"$f":"'Runoff Volume and CN'!$G$33","v":0},{"$f":"'Runoff Volume and CN'!$G$47","v":0},{"$f":"'Runoff Volume and CN'!$G$61","v":0},{"$f":"'Runoff Volume and CN'!$G$75","v":0},{"$f":"'Runoff Volume and CN'!$G$89","v":0}]
[null,null,"RV w RR (ws-in)",{"$f":"'Runoff Volume and CN'!$G$34","v":0},{"$f":"'Runoff Volume and CN'!$G$48","v":0},{"$f":"'Runoff Volume and CN'!$G$62","v":0},{"$f":"'Runoff Volume and CN'!$G$76","v":0},{"$f":"'Runoff Volume and CN'!$G$90","v":0}]
[null,null,"CN adjusted",{"$f":"'Runoff Volume and CN'!$G$35","v":0},{"$f":"'Runoff Volume and CN'!$G$49","v":0},{"$f":"'Runoff Volume and CN'!$G$63","v":0},{"$f":"'Runoff Volume and CN'!$G$77","v":0},{"$f":"'Runoff Volume and CN'!$G$91","v":0}]
[null,"10-year return period","RV wo RR (ws-in)",{"$f":"'Runoff Volume and CN'!$H$33","v":0},{"$f":"'Runoff Volume and CN'!$H$47","v":0},{"$f":"'Runoff Volume and CN'!$H$61","v":0},{"$f":"'Runoff Volume and CN'!$H$75","v":0},{"$f":"'Runoff Volume and CN'!$H$89","v":0}]
[null,null,"RV w RR (ws-in)",{"$f":"'Runoff Volume and CN'!$H$34","v":0},{"$f":"'Runoff Volume and CN'!$H$48","v":0},{"$f":"'Runoff Volume and CN'!$H$62","v":0},{"$f":"'Runoff Volume and CN'!$H$76","v":0},{"$f":"'Runoff Volume and CN'!$H$90","v":0}]
[null,null,"CN adjusted",{"$f":"'Runoff Volume and CN'!$H$35","v":0},{"$f":"'Runoff Volume and CN'!$H$49","v":0},{"$f":"'Runoff Volume and CN'!$H$63","v":0},{"$f":"'Runoff Volume and CN'!$H$77","v":0},{"$f":"'Runoff Volume and CN'!$H$91","v":0}]

{"sheet":"Notes","index":9,"n_rows":66,"n_cols":3,"rows_kept":66,"cut":false,"hidden":false,"merged":[[20,2,20,15],[16,2,16,15],[25,2,25,15],[30,2,30,16],[31,2,31,14],[29,2,29,18],[28,2,28,15],[27,2,27,18]]}
[]
[null,"Version 2.8 - June 2014 - 2011 BMP Stds & Specs"]
[]
[null,1,"Fixed summary sheet - totals /percentage column fixed"]
[null,2,"Corrected nitrogen efficiency percentages"]
[null,3,"Corrected the Rv value in column J for managed turf"]
[null,4,"Checked and revised runoff reduction credit values assigned"]
[]
[null,"Version 3.0 - 2011 and draft 2013 BMP Stds & Specs"]
[null,"General"]
[null,1,"Added error checks and user prompts to Site tab, DA tabs, and Runoff Volume and CN tab for data input errors."]
[null,{"$f":"B11+1","v":2},"Various format changes thoughout the spreadsheet."]
[null,{"$f":"B12+1","v":3},"Combined 2011 and 2013 BMP spreadsheets into one spreadsheet with a user selection option included in Site tab."]
[null,{"$f":"B13+1","v":4},"User input cell color changed from cyan blue to green; calculation cells changed from mid-grey to light grey; and added final result cell in indigo."]
[null,"Site tab"]
[null,{"$f":"B14+1","v":5},"Locked annual rainfall of 43 inches for use throughout Virginia since regulatory site based TP load limit is based on this value."]
[null,{"$f":"B16+1","v":6},"Corrected error in formula for total phosporus load reduction requirement. Previous formula was inconsistent with 9VAC25-870-63 A.2 and under certain circumstances provided erroneous TP load reduction requirement for development on prior developed lands."]
[null,7,"Added button and shortcut (Ctrl+Shift+R) to clear user inputs from all worksheets."]
[null,8,"Added shortcut (Ctrl+Shift+D) to clear land cover data from Site tab."]
[null,9,"Added TP Baseline Load for adjusted pre-redevelopement portion (cell C58)."]
[null,10,"Added note (triggered to appear when applicable) below \"Land Cover Summary for Redevelopment\" - indicating that reduction below baseline TP load (<0.41 lbs/acre) not required as per 9VAC25-870-63. "]
[null,11,"Added error messages when data input areas incomplete or not entered correctly."]
[null,12,"Conditional formatting (Summary sections grayed out) when input information incomplete or incorrect."]
[null,13,"Added Pre-redevelopment and Post-development load in lbs/acre/yr (row 57) for additional comparison purposes"]
[null,{"$f":"B24+1","v":14},"Corrected error in excel formula for new impervious cover Rv."]
[null,15,"Corrected errors in excel formula for total site area and Rv's in redevelopment portion: error appeared when soil types change between pre-redevelopment and post-development with no net increases in impervious increase."]
[null,16,"Added section for Final Post-Development to Land Cover Summaries to show combination of redevelopment portion and new net impervious cover portion."]
[null,17,"Added informational section in blue (columns B to F, rows 12-14) and input/error guide (columns H to K, rows 12-14) to indicate to users upfront when new net impervious cover is being triggered, when 10 or 20% reductions are being utilized, and when data entry is completed correctly."]
[null,18,"Added data entry instruction when user inputs blank (row 8)."]
[null,19,"Added option for linear development projects (row 6, and cells D64-G64)"]
[null,20,"Removed \"protected\" from  pre-redevelopment land cover type forest/open space since this is only required in post-development. (08/22/2017)"]
[null,21,"Added error notification to side error notes if total disturbed acreage entered is greater than post-development area entered. (08/22/2017)"]
[null,"D.A. tabs"]
[null,{"$f":"B32+1","v":22},"Added MTDs: Hydrodynamic, Filtering, Generic."]
[null,{"$f":"B34+1","v":23},"Added \"Total BMP Treatment Volume (ft3)\" column."]
[null,{"$f":"B35+1","v":24},"Rearranged previous Turf and Impervious input rows to adjacent cells in same row so each practice now located on 1 row only."]
[null,25,"Consolidated BMP Practice heading and added (RR or no RR label) to each practice to identify those with and without Runoff Reduction."]
[null,26,"Added  \" Total Phosphorus Available for Removal in D.A. _ (lbs)\"."]
[null,27,"Added button to clear BMP credit areas entered for each practice."]
[null,28,"Added user prompts to assist with user-input Rainwater Harvesting runoff reduction credit, and MTDs."]
[null,{"$f":"B40+1","v":29},"Renamed Credit and Phosphorus/Nitrogen Efficiency column headers to Runoff Removal Credit and Phosphorus/Nitrogen Removal Efficiency for clarity."]
[null,30,"Removed \"RR\" from Column headings referring to runoff volume and TP load from upstream practices (which may be RR or non-RR practices)."]
[null,31,"Renamed \"10. Wet Swale (Coastal Plain)\" to \"10. Wet Swale\" in BMP heading in order to improve clarity. The practice is well suited for but not limited to the Coastal Plain."]
[null,{"$f":"B43+1","v":32},"Renamed \"14. Manufactured BMPs\" section heading to \"14. Manufactured Treatment Device\"s for consistency with Virginia BMP Clearinghouse."]
[null,{"$f":"B44+1","v":33},"Added \"Micro-Bioretention #1\" and \"Micro-Bioretention #2\" to Bioretention headings (6.a and 6.b on tab, respectively) from Spec 9."]
[null,{"$f":"B45+1","v":34},"Replaced zero values from all data entry cells with blank cells, blocked out calculation and data entry cells where input or calculations are not applicable."]
[null,"Water Quality Compliance tab"]
[null,{"$f":"B46+1","v":35},"Optimized and reorganized for improved information output."]
[null,{"$f":"B48+1","v":36},"Added \"Runoff Reduction Volume and TP By Drainage Area\"."]
[null,{"$f":"B49+1","v":37},"Added section for linear development projects  (rows 21-26)"]
[null,"Runoff Volume and CN tab"]
[null,{"$f":"B50+1","v":38},"Reorganized and renamed Channel and Flood Protection tab to Runoff Volume and CN to more accurately reflect information provided."]
[null,{"$f":"B52+1","v":39},"Added user notes regarding limitations of Runoff Volume and CN tab for water quantity calculations."]
[null,{"$f":"B53+1","v":40},"Renamed CNweighted to CN(D.A. X) for the CNs based on soils and land cover types for each drainage area"]
[null,"Summary tab"]
[null,{"$f":"B54+1","v":41},"Added \"Print Preview\" button."]
[null,{"$f":"B56+1","v":42},"Fixed runtime error in Summary tab update macro."]
[null,{"$f":"B57+1","v":43},"Added \"BMP Treatment Volume\",  \"TP Load from Upstream practice\", \"TP Removed\" and \"TP remaining\" columns to Summary tab."]
[null,44,"Optimized macro efficiency and eliminated screen updating/flashing during macros."]
[null,45,"Corrected Summary tab macro -Turf missing routine missing \"<>\"."]
[null,46,"Added additional pre and post site data onto Summary tab."]
[null,47,"Added Error Summary Table to Summary tab (appears only if errors on Site tab or Drainage Area tabs are present)"]
[null,48,"Expanded and improved Runoff Coefficient and CN calculation section."]
[null,49,"Added summary information for linear projects, only populates if applicable."]
[null,50,"Macro glitch with MS Excel 2016 corrected. (08/22/2017)"]
[null,51,"Added Project Title and Date from Site tab. (8/22/2017)"]

{"sheet":"Summary_BU","index":10,"n_rows":179,"n_cols":11,"rows_kept":179,"cut":false,"hidden":true,"merged":[[173,1,175,1],[176,1,178,1],[5,8,8,9],[25,2,25,3],[26,2,26,3],[37,1,38,2],[37,3,38,3],[27,2,27,3],[28,2,28,3],[30,2,30,3],[7,2,7,3],[6,2,6,3],[32,2,32,5],[4,1,4,4],[33,2,33,5],[5,1,5,4],[46,1,46,2],[170,1,172,1]]}
[]
[null,{"$f":"Site!E1","v":"DEQ Virginia Runoff Reduction Method Re-Development Compliance Spreadsheet  - Version 3.0 "}]
[]
[null,{"$f":"Site!G11","v":"BMP Design Specifications List:"},{"$f":"Site!J11","v":"2013 Draft Stds & Specs"}]
[null,{"$f":"IF(Site!E6=\"Yes\",\"Site Summary - Linear Development Project***\",\"Site Summary\")","v":"Site Summary"}]
[null,{"$f":"IF(Site!B4=\"\",\"Project Title: NA\",\"Project Title: \" &Site!B4)","v":"Project Title: NA"}]
[null,{"$f":"IF(Site!B5=\"\",\"Date: NA\",\"Date: \" &Site!B5)","v":"Date: NA"},"Total Rainfall (in):",null,{"$f":"Site!B31","v":43}]
[null,null,"Total Disturbed Acreage: ",null,{"$f":"Site!F10","v":0}]
[]
[null,"Site Land Cover Summary",{"$f":"IF(Site!F10=\"ENTER TOTAL DISTURBED ACREAGE ABOVE!\", \"DISTURBED ACREAGE NOT ENTERED ON SITE TAB!\",IF(Site!F10>Site!F27,\"TOTAL DISTURBED ACREAGE GREATER THAN POST-DEVELOPMENT AREA IN SITE TAB!\",\"\"))","v":""}]
[]
[null,"Pre-ReDevelopment Land Cover  (acres)"]
[null,null,"A soils","B Soils","C Soils","D Soils","Totals","% of Total"]
[null,"Forest/Open (acres)",{"$f":"Site!B17","v":0},{"$f":"Site!C17","v":0},{"$f":"Site!D17","v":0},{"$f":"Site!E17","v":0},{"$f":"Site!F17","v":0},{"$f":"IF(G$17>0,G14/G$17*100,0)","v":0}]
[null,"Managed Turf (acres)",{"$f":"Site!B18","v":0},{"$f":"Site!C18","v":0},{"$f":"Site!D18","v":0},{"$f":"Site!E18","v":0},{"$f":"Site!F18","v":0},{"$f":"IF(G$17>0,G15/G$17*100,0)","v":0}]
[null,"Impervious Cover (acres)",{"$f":"Site!B19","v":0},{"$f":"Site!C19","v":0},{"$f":"Site!D19","v":0},{"$f":"Site!E19","v":0},{"$f":"Site!F19","v":0},{"$f":"IF(G$17>0,G16/G$17*100,0)","v":0}]
[null,null,null,null,null,null,{"$f":"Site!F20","v":0},{"$f":"SUM(H14:H16)","v":0}]
[]
[null,"Post-ReDevelopment Land Cover  (acres)"]
[null,null,"A soils","B Soils","C Soils","D Soils","Totals","% of Total"]
[null,"Forest/Open (acres)",{"$f":"Site!B24","v":0},{"$f":"Site!C24","v":0},{"$f":"Site!D24","v":0},{"$f":"Site!E24","v":0},{"$f":"Site!F24","v":0},{"$f":"IF(G$17>0,G21/G$17*100,0)","v":0},{"$f":"IF(Site!F24>0,\"*\",\"\")","v":""}]
[null,"Managed Turf (acres)",{"$f":"Site!B25","v":0},{"$f":"Site!C25","v":0},{"$f":"Site!D25","v":0},{"$f":"Site!E25","v":0},{"$f":"Site!F25","v":0},{"$f":"IF(G$17>0,G22/G$17*100,0)","v":0}]
[null,"Impervious Cover (acres)",{"$f":"Site!B26","v":0},{"$f":"Site!C26","v":0},{"$f":"Site!D26","v":0},{"$f":"Site!E26","v":0},{"$f":"Site!F26","v":0},{"$f":"IF(G$17>0,G23/G$17*100,0)","v":0}]
[null,{"$f":"IF(Site!F24>0,\"* Forest/Open Space areas must be protected in accordance with the Virginia Runoff Reduction Method\",\"\")","v":""},null,null,null,null,{"$f":"Site!F27","v":0},{"$f":"SUM(H21:H23)","v":0}]
[null,"Site Tv and Land Cover Nutrient Loads"]
[null,null,"Final Post-Development \n(Post-ReDevelopment \n& New Impervious)",null,"Post-ReDevelopment","Post-Development (New Impervious)","Adjusted Pre-ReDevelopment",null,{"$f":"Site!A57","v":"Pre-ReDevelopment TP Load per acre\n(lb/acre/yr)"},{"$f":"Site!E57","v":"Final Post-Development TP Load per acre \n(lb/acre/yr)"},{"$f":"Site!H57","v":"Post-ReDevelopment TP Load per acre \n(lb/acre/yr)"}]
[null,"Site Rv",{"$f":"Site!F52","v":"--"},null,{"$f":"Site!I52","v":"--"},{"$f":"Site!L49","v":"--"},{"$f":"Site!C52","v":"--"},null,{"$f":"Site!C57","v":"--"},{"$f":"Site!F57","v":"--"},{"$f":"Site!I57","v":"--"}]
[null,"Treatment Volume (ft3) ",{"$f":"Site!F55","v":"--"},null,{"$f":"Site!I55","v":"--"},{"$f":"Site!L55","v":"--"},{"$f":"Site!C55","v":"--"}]
[null,"TP Load (lb/yr)",{"$f":"Site!F56","v":"--"},null,{"$f":"Site!I56","v":"--"},{"$f":"Site!L56","v":"--"},{"$f":"Site!C56","v":"--"}]
[null,null,null,{"$f":"IF(Site!D56=\"*\",\"Baseline TP Load (lb/yr):\",\"\")","v":""},{"$f":"IF(Site!D56=\"*\",Site!C58&\"*\",\"\")","v":""},{"$f":"IF(Site!D56=\"*\",\"*Reduction below new development load limitation not required\",\"\")","v":""}]
[null,"Total TP Load Reduction Required (lb/yr)",{"$f":"IF(Site!G63=\"--\",\"--\",IF(Site!$G$63=Site!$O$2,\"Check Areas!\",IF(Site!$E6=\"yes\",ROUND(Site!$G$64,2),Site!$G$63)))","v":"--"},null,{"$f":"IF(Site!$E6=\"yes\",\"N/A***\",IF(Site!I60=Site!$O$3,\"x\",Site!I60))","v":"--"},{"$f":"IF(Site!$E6=\"yes\",\"N/A***\",IF(Site!$L$60=Site!$O$3,\"x\",Site!$L$60))","v":"--"}]
[null,null,{"$f":"IF(Site!E6=\"yes\",\"***This is a linear development project\",\"\")","v":""}]
[null,null,"Final Post-Development Load \n(Post-ReDevelopment & New Impervious) ",null,null,null,"Pre-ReDevelopment"]
[null,"TN Load (lb/yr)",{"$f":"Site!I67","v":"--"},null,null,null,{"$f":"Site!D67","v":"--"}]
[]
[null,{"$f":"IF(C36=\"\",\"Site Compliance Summary\",\"Site Compliance Summary -\")","v":"Site Compliance Summary"},{"$f":"IF(Site!E6=\"yes\",\"***Linear Development Project\",\"\")","v":""}]
[]
[null,"Maximum % Reduction Required Below \nPre-ReDevelopment Load",null,{"$f":"IF(Site!I58=Site!$O$2,\"x\",Site!$I58)","v":"--"},{"$f":"IF(Site!D56=\"*\",\"  * Note: % Reduction will reduce post-development TP load to less than or equal to baseline load of \"&ROUND(Site!C58,2)&\" lb/yr (0.41 lb/ac/yr)\",\"\")","v":""}]
[null,null,null,null,{"$f":"IF(D30=\"\",\"\",IF(Site!E6=\"yes\",\"[Post-Dev Reduction Requirement = Post-Dev TP load - baseline load of \"&ROUND(Site!C58,2)&\" lb/yr], baseline load = site area x 0.41 lb/ac/yr\",IF(E38=\"\",\"\",\"    [Required reduction for Post-ReDev. = Post-ReDev TP load - baseline load of \"&Site!C58&\" lb/yr], baseline load = site area x 0.41 lb/ac/yr\")))","v":""}]
[]
[]
[null,"Total Runoff Volume Reduction (ft3)  ",{"$f":"'Water Quality Compliance'!H14","v":0},null,{"$f":"IF(AND(E43=E44,E44=E45,Site!P5=0),\"\",IF(Site!P5=\"incomplete\",\"Site tab incomplete\",\"Error Summary:\"))","v":""}]
[null,"Total TP Load Reduction Achieved (lb/yr)",{"$f":"IF(Site!E6=\"yes\",'Water Quality Compliance'!E24,'Water Quality Compliance'!C24)","v":"--"},null,{"$f":"IF(Site!P5=0,\"\",\"Errors on Site tab\")","v":""}]
[null,"Total TN Load Reduction Achieved (lb/yr)",{"$f":"'Water Quality Compliance'!C30","v":"--"},null,{"$f":"IF((COUNTIF(C55:G55,\"\"))=5,\"\",\" Errors on D.A. tab(s)\")","v":""}]
[null,"Remaining Post Development TP Load (lb/yr)",{"$f":"IFERROR(C29-C43,\"--\")","v":"--"},null,{"$f":"IF(OR(I51=\"X\", I52=\"X\",I53=\"X\"),\" Areas on D.A. tab(s) exceed Site tab areas\",\"\")","v":""}]
[null,"Remaining TP Load Reduction (lb/yr) Required",{"$f":"IFERROR(IF(AND(E43=E44,E44=E45),(IF(Site!E6=\"yes\",'Water Quality Compliance'!E26,'Water Quality Compliance'!C26)),\"Check Errors!\"),\"--\")","v":"--"},{"$f":"IF(C46=\"Check Errors!\",\"\",IF(Site!E6=\"no\",'Water Quality Compliance'!B27,'Water Quality Compliance'!F26))","v":""}]
[null,{"$f":"F30","v":""},null,{"$f":"IFERROR(IF(AND(C31-C43<0.005,C43<C31),\"      (Remaining TP load reduction <0.005)\",\"\"),\"\")","v":""}]
[null,"Drainage Area Summary"]
[]
[null,null,"D.A. A","D.A. B","D.A. C","D.A. D","D.A. E","Total"]
[null,"Forest/Open (acres)",{"$f":"'D.A. A'!F5","v":0},{"$f":"'D.A. B'!F5","v":0},{"$f":"'D.A. C'!F5","v":0},{"$f":"'D.A. D'!F5","v":0},{"$f":"'D.A. E'!F5","v":0},{"$f":"SUM(C51:G51)","v":0},{"$f":"IF(Site!F24<('D.A. A'!F5+'D.A. B'!F5+'D.A. C'!F5+'D.A. D'!F5+'D.A. E'!F5),\"X\",\"\")","v":""}]
[null,"Managed Turf (acres)",{"$f":"'D.A. A'!F6","v":0},{"$f":"'D.A. B'!F6","v":0},{"$f":"'D.A. C'!F6","v":0},{"$f":"'D.A. D'!F6","v":0},{"$f":"'D.A. E'!F6","v":0},{"$f":"SUM(C52:G52)","v":0},{"$f":"IF('Water Quality Compliance'!H6=\"OK.\",\"\",\"X\")","v":""}]
[null,"Impervious Cover (acres)",{"$f":"'D.A. A'!F7","v":0},{"$f":"'D.A. B'!F7","v":0},{"$f":"'D.A. C'!F7","v":0},{"$f":"'D.A. D'!F7","v":0},{"$f":"'D.A. E'!F7","v":0},{"$f":"SUM(C53:G53)","v":0},{"$f":"IF('Water Quality Compliance'!H4=\"OK.\",\"\",\"X\")","v":""}]
[null,"Total Area (acres)",{"$f":"SUM(C51:C53)","v":0},{"$f":"SUM(D51:D53)","v":0},{"$f":"SUM(E51:E53)","v":0},{"$f":"SUM(F51:F53)","v":0},{"$f":"SUM(G51:G53)","v":0},{"$f":" SUM(H51:H53)","v":0}]
[null,null,{"$f":"IF('Water Quality Compliance'!C8=\"OK.\",\"\",\"D.A. A Errors!\")","v":""},{"$f":"IF('Water Quality Compliance'!D8=\"OK.\",\"\",\"D.A. B Errors!\")","v":""},{"$f":"IF('Water Quality Compliance'!E8=\"OK.\",\"\",\"D.A. C Errors!\")","v":""},{"$f":"IF('Water Quality Compliance'!F8=\"OK.\",\"\",\"D.A. D Errors!\")","v":""},{"$f":"IF('Water Quality Compliance'!G8=\"OK.\",\"\",\"D.A. E Errors!\")","v":""}]
[null,"Drainage Area Compliance Summary"]
[]
[null,null,"D.A. A","D.A. B","D.A. C","D.A. D","D.A. E","Total"]
[null,"TP Load Reduced (lb/yr)",{"$f":"'D.A. A'!I104","v":0},{"$f":"'D.A. B'!I104","v":0},{"$f":"'D.A. C'!I104","v":0},{"$f":"'D.A. D'!I104","v":0},{"$f":"'D.A. E'!I104","v":0},{"$f":"SUM(C59:G59)","v":0}]
[null,"TN Load Reduced (lb/yr)",{"$f":"'D.A. A'!I111","v":0},{"$f":"'D.A. B'!I111","v":0},{"$f":"'D.A. C'!I111","v":0},{"$f":"'D.A. D'!I111","v":0},{"$f":"'D.A. E'!I111","v":0},{"$f":"SUM(C60:G60)","v":0}]
[]
[]
[null,"Drainage Area A Summary"]
[]
[null,"Land Cover Summary"]
[null,null,{"$f":"'D.A. A'!$B$3","v":""}]
[null,null,"A Soils","B Soils","C Soils","D Soils","Total","% of Total"]
[null,"Forest/Open (acres)",{"$f":"'D.A. A'!B5","v":0},{"$f":"'D.A. A'!C5","v":0},{"$f":"'D.A. A'!D5","v":0},{"$f":"'D.A. A'!E5","v":0},{"$f":"'D.A. A'!F5","v":0},{"$f":"IF(G71>0,G68/G71*100,0)","v":0}]
[null,"Managed Turf (acres)",{"$f":"'D.A. A'!B6","v":0},{"$f":"'D.A. A'!C6","v":0},{"$f":"'D.A. A'!D6","v":0},{"$f":"'D.A. A'!E6","v":0},{"$f":"'D.A. A'!F6","v":0},{"$f":"IF(G71>0,G69/G71*100,0)","v":0}]
[null,"Impervious Cover (acres)",{"$f":"'D.A. A'!B7","v":0},{"$f":"'D.A. A'!C7","v":0},{"$f":"'D.A. A'!D7","v":0},{"$f":"'D.A. A'!E7","v":0},{"$f":"'D.A. A'!F7","v":0},{"$f":"IF(G71>0,G70/G71*100,0)","v":0}]
[null,null,null,null,null,null,{"$f":"SUM(G68:G70)","v":0}]
[]
[null,"BMP Selections"]
[]
[null,"Practice","Managed Turf Credit Area (acres)","Impervious Cover Credit Area (acres)","BMP Treatment Volume (ft3)","TP Load from Upstream Practices (lbs)","Untreated TP Load to Practice (lbs)","TP Removed (lb/yr)","TP Remaining (lb/yr)","Downstream Treatment to be Employed"]
[]
[null,"Total Impervious Cover Treated (acres)",{"$f":"'D.A. A'!$F$96","v":0}]
[null,"Total Turf Area Treated (acres) ",{"$f":"'D.A. A'!$F$97","v":0}]
[null,"Total TP Load Reduction Achieved in D.A. (lb/yr)",{"$f":"'D.A. A'!$I$104","v":0}]
[null,"Total TN Load Reduction Achieved in D.A. (lb/yr)",{"$f":"'D.A. A'!$I$111","v":0}]
[]
[]
[null,"Drainage Area B Summary"]
[]
[null,"Land Cover Summary"]
[null,null,{"$f":"'D.A. B'!$B$3","v":""}]
[null,null,"A Soils","B Soils","C Soils","D Soils","Total","% of Total"]
[null,"Forest/Open (acres)",{"$f":"'D.A. B'!B5","v":0},{"$f":"'D.A. B'!C5","v":0},{"$f":"'D.A. B'!D5","v":0},{"$f":"'D.A. B'!E5","v":0},{"$f":"'D.A. B'!F5","v":0},{"$f":"IF(G91>0,G88/G91*100,0)","v":0}]
[null,"Managed Turf (acres)",{"$f":"'D.A. B'!B6","v":0},{"$f":"'D.A. B'!C6","v":0},{"$f":"'D.A. B'!D6","v":0},{"$f":"'D.A. B'!E6","v":0},{"$f":"'D.A. B'!F6","v":0},{"$f":"IF(G91>0,G89/G91*100,0)","v":0}]
[null,"Impervious Cover (acres)",{"$f":"'D.A. B'!B7","v":0},{"$f":"'D.A. B'!C7","v":0},{"$f":"'D.A. B'!D7","v":0},{"$f":"'D.A. B'!E7","v":0},{"$f":"'D.A. B'!F7","v":0},{"$f":"IF(G91>0,G90/G91*100,0)","v":0}]
[null,null,null,null,null,null,{"$f":"SUM(G88:G90)","v":0}]
[]
[null,"BMP Selections"]
[]
[null,"Practice","Managed Turf Credit Area (acres)","Impervious Cover Credit Area (acres)","BMP Treatment Volume (ft3)","TP Load from Upstream Practices (lbs)","Untreated TP Load to Practice (lbs)","TP Removed (lb/yr)","TP Remaining (lb/yr)","Downstream Treatment to be Employed"]
[]
[null,"Total Impervious Cover Treated (acres)",{"$f":"'D.A. B'!$F$96","v":0}]
[null,"Total Turf Area Treated (acres) ",{"$f":"'D.A. B'!$F$97","v":0}]
[null,"Total TP Load Reduction Achieved in D.A. (lb/yr)",{"$f":"'D.A. B'!$I$104","v":0}]
[null,"Total TN Load Reduction Achieved in D.A. (lb/yr)",{"$f":"'D.A. B'!$I$111","v":0}]
[]
[]
[null,"Drainage Area C Summary"]
[]
[null,"Land Cover Summary"]
[null,null,{"$f":"'D.A. C'!$B$3","v":""}]
[null,null,"A Soils","B Soils","C Soils","D Soils","Total","% of Total"]
[null,"Forest/Open (acres)",{"$f":"'D.A. C'!B5","v":0},{"$f":"'D.A. C'!C5","v":0},{"$f":"'D.A. C'!D5","v":0},{"$f":"'D.A. C'!E5","v":0},{"$f":"'D.A. C'!F5","v":0},{"$f":"IF(G111>0,G108/G111*100,0)","v":0}]
[null,"Managed Turf (acres)",{"$f":"'D.A. C'!B6","v":0},{"$f":"'D.A. C'!C6","v":0},{"$f":"'D.A. C'!D6","v":0},{"$f":"'D.A. C'!E6","v":0},{"$f":"'D.A. C'!F6","v":0},{"$f":"IF(G111>0,G109/G111*100,0)","v":0}]
[null,"Impervious Cover (acres)",{"$f":"'D.A. C'!B7","v":0},{"$f":"'D.A. C'!C7","v":0},{"$f":"'D.A. C'!D7","v":0},{"$f":"'D.A. C'!E7","v":0},{"$f":"'D.A. C'!F7","v":0},{"$f":"IF(G111>0,G110/G111*100,0)","v":0}]
[null,null,null,null,null,null,{"$f":"SUM(G108:G110)","v":0}]
[]
[null,"BMP Selections"]
[]
[null,"Practice","Managed Turf Credit Area (acres)","Impervious Cover Credit Area (acres)","BMP Treatment Volume (ft3)","TP Load from Upstream Practices (lbs)","Untreated TP Load to Practice (lbs)","TP Removed (lb/yr)","TP Remaining (lb/yr)","Downstream Treatment to be Employed"]
[]
[null,"Total Impervious Cover Treated (acres)",{"$f":"'D.A. C'!$F$96","v":0}]
[null,"Total Turf Area Treated (acres) ",{"$f":"'D.A. C'!$F$97","v":0}]
[null,"Total TP Load Reduction Achieved in D.A. (lb/yr)",{"$f":"'D.A. C'!$I$104","v":0}]
[null,"Total TN Load Reduction Achieved in D.A. (lb/yr)",{"$f":"'D.A. C'!$I$111","v":0}]
[]
[]
[null,"Drainage Area D Summary"]
[]
[null,"Land Cover Summary"]
[null,null,{"$f":"'D.A. D'!$B$3","v":""}]
[null,null,"A Soils","B Soils","C Soils","D Soils","Total","% of Total"]
[null,"Forest/Open (acres)",{"$f":"'D.A. D'!B5","v":0},{"$f":"'D.A. D'!C5","v":0},{"$f":"'D.A. D'!D5","v":0},{"$f":"'D.A. D'!E5","v":0},{"$f":"'D.A. D'!F5","v":0},{"$f":"IF(G131>0,G128/G131*100,0)","v":0}]
[null,"Managed Turf (acres)",{"$f":"'D.A. D'!B6","v":0},{"$f":"'D.A. D'!C6","v":0},{"$f":"'D.A. D'!D6","v":0},{"$f":"'D.A. D'!E6","v":0},{"$f":"'D.A. D'!F6","v":0},{"$f":"IF(G131>0,G129/G131*100,0)","v":0}]
[null,"Impervious Cover (acres)",{"$f":"'D.A. D'!B7","v":0},{"$f":"'D.A. D'!C7","v":0},{"$f":"'D.A. D'!D7","v":0},{"$f":"'D.A. D'!E7","v":0},{"$f":"'D.A. D'!F7","v":0},{"$f":"IF(G131>0,G130/G131*100,0)","v":0}]
[null,null,null,null,null,null,{"$f":"SUM(G128:G130)","v":0}]
[]
[null,"BMP Selections"]
[]
[null,"Practice","Managed Turf Credit Area (acres)","Impervious Cover Credit Area (acres)","BMP Treatment Volume (ft3)","TP Load from Upstream Practices (lbs)","Untreated TP Load to Practice (lbs)","TP Removed (lb/yr)","TP Remaining (lb/yr)","Downstream Treatment to be Employed"]
[]
[null,"Total Impervious Cover Treated (acres)",{"$f":"'D.A. D'!$F$96","v":0}]
[null,"Total Turf Area Treated (acres) ",{"$f":"'D.A. D'!$F$97","v":0}]
[null,"Total TP Load Reduction Achieved in D.A. (lb/yr)",{"$f":"'D.A. D'!$I$104","v":0}]
[null,"Total TN Load Reduction Achieved in D.A. (lb/yr)",{"$f":"'D.A. D'!$I$111","v":0}]
[]
[]
[null,"Drainage Area E Summary"]
[]
[null,"Land Cover Summary"]
[null,null,{"$f":"'D.A. E'!$B$3","v":""}]
[null,null,"A Soils","B Soils","C Soils","D Soils","Total","% of Total"]
[null,"Forest/Open (acres)",{"$f":"'D.A. E'!B5","v":0},{"$f":"'D.A. E'!C5","v":0},{"$f":"'D.A. E'!D5","v":0},{"$f":"'D.A. E'!E5","v":0},{"$f":"'D.A. E'!F5","v":0},{"$f":"IF(G151>0,G148/G151*100,0)","v":0}]
[null,"Managed Turf (acres)",{"$f":"'D.A. E'!B6","v":0},{"$f":"'D.A. E'!C6","v":0},{"$f":"'D.A. E'!D6","v":0},{"$f":"'D.A. E'!E6","v":0},{"$f":"'D.A. E'!F6","v":0},{"$f":"IF(G151>0,G149/G151*100,0)","v":0}]
[null,"Impervious Cover (acres)",{"$f":"'D.A. E'!B7","v":0},{"$f":"'D.A. E'!C7","v":0},{"$f":"'D.A. E'!D7","v":0},{"$f":"'D.A. E'!E7","v":0},{"$f":"'D.A. E'!F7","v":0},{"$f":"IF(G151>0,G150/G151*100,0)","v":0}]
[null,null,null,null,null,null,{"$f":"SUM(G148:G150)","v":0}]
[]
[null,"BMP Selections"]
[]
[null,"Practice","Managed Turf Credit Area (acres)","Impervious Cover Credit Area (acres)","BMP Treatment Volume (ft3)","TP Load from Upstream Practices (lbs)","Untreated TP Load to Practice (lbs)","TP Removed (lb/yr)","TP Remaining (lb/yr)","Downstream Treatment to be Employed"]
[]
[null,"Total Impervious Cover Treated (acres)",{"$f":"'D.A. E'!$F$96","v":0}]
[null,"Total Turf Area Treated (acres) ",{"$f":"'D.A. E'!$F$97","v":0}]
[null,"Total TP Load Reduction Achieved in D.A. (lb/yr)",{"$f":"'D.A. E'!$I$104","v":0}]
[null,"Total TN Load Reduction Achieved in D.A. (lb/yr)",{"$f":"'D.A. E'!$I$111","v":0}]
[]
[]
[null,"Runoff Volume and CN Calculations"]
[]
[null,null,"1-year storm","2-year storm ","10-year storm "]
[null,"Target Rainfall Event (in)",{"$f":"'Runoff Volume and CN'!$F$6","v":0},{"$f":"'Runoff Volume and CN'!$G$6","v":0},{"$f":"'Runoff Volume and CN'!$H$6","v":0}]
[]
[null,"Drainage Areas","RV & CN","Drainage Area A","Drainage Area B","Drainage Area C","Drainage Area D","Drainage Area E"]
[null,"CN",null,{"$f":"'Runoff Volume and CN'!$I$31","v":0},{"$f":"'Runoff Volume and CN'!$I$45","v":0},{"$f":"'Runoff Volume and CN'!$I$59","v":0},{"$f":"'Runoff Volume and CN'!$I$73","v":0},{"$f":"'Runoff Volume and CN'!$I$87","v":0}]
[null,"RR (ft3)",null,{"$f":"'D.A. A'!$F$60","v":0},{"$f":"'D.A. B'!$F$60","v":0},{"$f":"'D.A. C'!$F$60","v":0},{"$f":"'D.A. D'!$F$60","v":0},{"$f":"'D.A. E'!$F$60","v":0}]
[null,"1-year return period","RV wo RR (ws-in)",{"$f":"'Runoff Volume and CN'!$F$33","v":0},{"$f":"'Runoff Volume and CN'!$F$47","v":0},{"$f":"'Runoff Volume and CN'!$F$61","v":0},{"$f":"'Runoff Volume and CN'!$F$75","v":0},{"$f":"'Runoff Volume and CN'!$F$89","v":0}]
[null,null,"RV w RR (ws-in)",{"$f":"'Runoff Volume and CN'!$F$34","v":0},{"$f":"'Runoff Volume and CN'!$F$48","v":0},{"$f":"'Runoff Volume and CN'!$F$62","v":0},{"$f":"'Runoff Volume and CN'!$F$76","v":0},{"$f":"'Runoff Volume and CN'!$F$90","v":0}]
[null,null,"CN adjusted",{"$f":"'Runoff Volume and CN'!$F$35","v":0},{"$f":"'Runoff Volume and CN'!$F$49","v":0},{"$f":"'Runoff Volume and CN'!$F$63","v":0},{"$f":"'Runoff Volume and CN'!$F$77","v":0},{"$f":"'Runoff Volume and CN'!$F$91","v":0}]
[null,"2-year return period","RV wo RR (ws-in)",{"$f":"'Runoff Volume and CN'!$G$33","v":0},{"$f":"'Runoff Volume and CN'!$G$47","v":0},{"$f":"'Runoff Volume and CN'!$G$61","v":0},{"$f":"'Runoff Volume and CN'!$G$75","v":0},{"$f":"'Runoff Volume and CN'!$G$89","v":0}]
[null,null,"RV w RR (ws-in)",{"$f":"'Runoff Volume and CN'!$G$34","v":0},{"$f":"'Runoff Volume and CN'!$G$48","v":0},{"$f":"'Runoff Volume and CN'!$G$62","v":0},{"$f":"'Runoff Volume and CN'!$G$76","v":0},{"$f":"'Runoff Volume and CN'!$G$90","v":0}]
[null,null,"CN adjusted",{"$f":"'Runoff Volume and CN'!$G$35","v":0},{"$f":"'Runoff Volume and CN'!$G$49","v":0},{"$f":"'Runoff Volume and CN'!$G$63","v":0},{"$f":"'Runoff Volume and CN'!$G$77","v":0},{"$f":"'Runoff Volume and CN'!$G$91","v":0}]
[null,"10-year return period","RV wo RR (ws-in)",{"$f":"'Runoff Volume and CN'!$H$33","v":0},{"$f":"'Runoff Volume and CN'!$H$47","v":0},{"$f":"'Runoff Volume and CN'!$H$61","v":0},{"$f":"'Runoff Volume and CN'!$H$75","v":0},{"$f":"'Runoff Volume and CN'!$H$89","v":0}]
[null,null,"RV w RR (ws-in)",{"$f":"'Runoff Volume and CN'!$H$34","v":0},{"$f":"'Runoff Volume and CN'!$H$48","v":0},{"$f":"'Runoff Volume and CN'!$H$62","v":0},{"$f":"'Runoff Volume and CN'!$H$76","v":0},{"$f":"'Runoff Volume and CN'!$H$90","v":0}]
[null,null,"CN adjusted",{"$f":"'Runoff Volume and CN'!$H$35","v":0},{"$f":"'Runoff Volume and CN'!$H$49","v":0},{"$f":"'Runoff Volume and CN'!$H$63","v":0},{"$f":"'Runoff Volume and CN'!$H$77","v":0},{"$f":"'Runoff Volume and CN'!$H$91","v":0}]

{"sheet":"VHid","index":11,"n_rows":1,"n_cols":1,"rows_kept":1,"cut":false,"hidden":true,"merged":[]}
["reVRRMsafe2015"]